{"text_format":"1","workbook":"xlsx","n_sheets":9,"sheets":["Setup","DrawPrep","MD","Day1","Day2","notes","PrgPrep","tables","matches"],"not_rendered":{"charts":0,"images":0,"macros":1,"external_links":0,"defined_names":3,"comments":0,"pivot_tables":0},"unopened":[],"bounds":{"document_bytes":16777216,"sheet_cells":100000,"rows_first":2000,"rows_last":500,"rows_between":2000,"halvings":0,"cell_chars":16384,"cell_head_chars":4096},"cells_cut":0,"cells_raw":0,"read":"whole","date_system":"1900"}

{"sheet":"Setup","index":0,"n_rows":34,"n_cols":12,"rows_kept":34,"cut":false,"hidden":false,"merged":[[1,3,2,3],[4,3,7,3]]}
["Μέγεθος ταμπλό: ",32,null,"Θέσεις","seed",null,null,0,"seed","space pos","Index","Value"]
[null,null,null,"3-4",{"$f":"VALUE(LEFT(F2,1))","v":3},"3 4",null,{"$f":"IF(I2=\"-\",\"-\",IF(I2>0,H1+1,0))","v":0},{"$f":"IF(J2>0,VALUE(MID($A$32,1,J2-1)),\"-\")","v":0},{"$f":"IF(LEN($A$32)>1,FIND(\" \",$A$32,1),0)","v":2},0,0]
["Διοργανωτής: ","Ζ΄ ΕΝΩΣΗ",null,null,{"$f":"VALUE(RIGHT(F2,1))","v":4},null,null,0,{"$f":"IF(J3>0,VALUE(MID($A$32,J2+1,J3-J2-1)),\"-\")","v":0},{"$f":"IF(AND(J2>0,LEN($A$32)>J2+1),FIND(\" \",$A$32,J2+1),0)","v":4},0,0]
["Τίτλος Τουρνουά: ","3ο Ε3 2016",null,"Θέσεις","seed",null,null,0,0,6,0,0]
["grade: ","e3",null,"5-8",{"$f":"TRIM(LEFT(F5,(FIND(\" \",F5,1)-1)))","v":"6"},"6 7 5 8",null,0,0,8,0,0]
["age: ",12,null,null,{"$f":"TRIM(MID(F5,(FIND(\" \",F5,1)),FIND(\" \",F5,(FIND(\" \",F5,1)+1))-(FIND(\" \",F5,1))))","v":"7"},null,null,0,0,10,0,0]
["Έδρα αγώνων: ","Γ.Σ. ΛΙΒΥΚΟΣ ΙΕΡΑΠ.",null,null,{"$f":"TRIM(MID(F5, (FIND(\" \",F5,(FIND(\" \",F5,1)+1))+1), (FIND(\" \",F5,(FIND(\" \",F5,(FIND(\" \",F5,1)+1))+1)))-(FIND(\" \",F5,(FIND(\" \",F5,1)+1))+1)))","v":"5"},null,null,0,0,12,0,0]
["Κατηγορία: ","Α12",null,null,{"$f":"TRIM(RIGHT(F5,LEN(F5)-(FIND(\" \",F5,(FIND(\" \",F5,(FIND(\" \",F5,1)+1))+1)))))","v":"8"},null,null,1,1,14,1,1]
["Έναρξη: ","22",null,null,null,null,null,2,2,16,2,2]
["Λήξη: ","23 Οκτωβρίου ",null,null,null,null,null,3,3,18,3,3]
["Επιδιατητής: ","Κ. Χατζηδάκης",null,null,null,null,null,4,{"$f":"IF(J11>0,VALUE(MID($A$32,J10+1,J11-J10-1)),\"-\")","v":4},20,4,4]
["Τηλέφωνο επιδ: ",6948254785,null,null,null,null,null,{"$f":"IF(I12=\"-\",\"-\",IF(I12>0,H11+1,0))","v":5},5,22,5,5]
[null,null,null,null,null,null,null,6,6,24,6,6]
[null,null,null,null,null,null,null,7,7,26,7,7]
[null,null,null,null,null,null,null,8,8,28,8,8]
[null,null,null,null,null,null,null,9,18,31,9,18]
["Main Draw",{"$f":"\"(\"&COUNTBLANK(DrawPrep!D3:D34)&\")\"","v":"(6)"},null,null,null,null,null,10,9,33,10,9]
["Πλήθος bye (0-15): ",{"$f":"COUNTBLANK(DrawPrep!D3:D34)","v":6},null,null,null,null,null,11,10,36,11,10]
["Αριθμός θέσεων seeded: ",8,null,null,null,null,null,12,26,39,12,26]
[null,null,null,null,null,null,null,13,21,42,13,21]
[null,null,null,null,null,null,null,14,25,45,14,25]
[null,null,null,null,null,null,null,15,20,48,15,20]
[null,null,null,null,null,null,null,16,22,51,16,22]
["md  (# για off) ","ok",null,null,null,null,null,17,12,54,17,12]
[null,null,null,null,null,null,null,18,19,57,18,19]
[{"$f":"RandUniq(3,4,2)","v":"4 3"},null,null,null,null,null,null,19,17,60,19,17]
[{"$f":"RandUniq(5,8,4)","v":"5 6 7 8"},null,null,null,null,null,null,20,11,63,20,11]
[null,null,null,null,null,null,null,21,15,66,21,15]
[{"$f":"CONCATENATE(LEFT($A$34,$B$18*2),LEFT($A$33,$B$19*2),RandUniq($B$19+1,32-$B$18,32-$B$19-$B$18),\" \")","v":"0 0 0 0 0 0 1 2 3 4 5 6 7 8 24 13 22 10 21 16 12 18 15 14 19 9 23 17 20 25 26 11 "},null,null,null,null,null," ",22,23,69,22,23]
[null,null,null,null,null,null,null,23,16,72,23,16]
[null,null," ",null,null,null,null,24,14,75,24,14]
["0 0 0 0 0 0 1 2 3 4 5 6 7 8 18 9 10 26 21 25 20 22 12 19 17 11 15 23 16 14 24 13 ",null,null,null,null,null,null,25,24,78,25,24]
["1 2 3 4 5 6 7 8 ",null,null,null,null,null,null,26,13,81,26,13]
["0 0 0 0 0 0 0 0 0 0 0 0 0 0 0 0 0 0 0 0 0 0 0 0 0 0 0 0 0 0 0 0 0 0 0 0 0 0 0 0  "]

{"sheet":"DrawPrep","index":1,"n_rows":43,"n_cols":10,"rows_kept":43,"cut":false,"hidden":false,"merged":[[36,1,36,3]]}
[{"$f":"Setup!$B$3 & \", \" & Setup!$B$4 & \", \" & Setup!$B$7 & \", \" & Setup!$B$9 & \"-\" & Setup!$B$10","v":"Ζ΄ ΕΝΩΣΗ, 3ο Ε3 2016, Γ.Σ. ΛΙΒΥΚΟΣ ΙΕΡΑΠ., 22-23 Οκτωβρίου "},null,null,null,null,null,null,{"$f":"Setup!B8","v":"Α12"}]
["α/α","από","Α.Μ.","Ονοματεπώνυμο","Σύλλογος","βαθμοί","Τηλέφωνο","Υπογραφή","SortPts","Rnd"]
[1,null,31617,"ΜΑΤΣΑΜΑΚΗΣ ΕΛΕΥΘΕΡΙΟΣ","Ο.Α.ΧΑΝΙΩΝ",41,null,null,{"$f":"IF(D3>\" \",F3+J3,0)","v":41.002259164629486},2.2591646294891051E-3]
[2,null,36263,"ΜΑΝΔΑΛΕΝΑΚΗΣ ΑΝΑΣΤΑΣΙΟΣ","ΗΡΑΚΛΕΙΟ Ο.Α.& Α.",28,null,null,28.001378200434484,1.3782004344844291E-3]
[3,null,36456,"ΓΕΝΝΑΡΑΚΗΣ ΝΙΚΟΛΑΟΣ","ΗΡΑΚΛΕΙΟ Ο.Α.& Α.",26,null,null,26.002792129153413,2.7921291534137617E-3]
[4,null,33396,"ΖΕΡΒΟΣ ΣΤΥΛΙΑΝΟΣ","Ο.Α.ΧΑΝΙΩΝ",21.5,null,null,21.503772078196633,3.7720781966312684E-3]
[5,null,37032,"ΧΑΛΑΚΑΤΕΒΑΚΗΣ ΑΠΟΣΤΟΛΟΣ","Ο.Α.ΧΑΝΙΩΝ",19.5,null,null,19.501555645607844,1.555645607844698E-3]
[6,null,32350,"ΠΕΤΡΑΚΗΣ ΣΤΥΛΙΑΝΟΣ","Ο.Α.ΧΑΝΙΩΝ",17.5,null,null,17.503670153316296,3.6701533162968075E-3]
[7,null,37665,"ΚΟΚΚΙΝΑΚΗΣ ΓΕΩΡΓΙΟΣ","Ο.Α.ΧΑΝΙΩΝ",17,null,null,17.002871469877714,2.8714698777152652E-3]
[8,null,35629,"ΣΠΥΡΟΠΟΥΛΟΣ ΝΙΚΟΛΑΟΣ","Ο.Α.ΡΕΘΥΜΝΟΥ",14.5,null,null,14.500513296393056,5.1329639305528992E-4]
[9,null,33295,"ΒΟΛΤΥΡΑΚΗΣ ΕΥΤΥΧΙΟΣ","Ο.Α.ΧΑΝΙΩΝ",13,null,null,13.003723098747528,3.7230987475287761E-3]
[10,null,36550,"ΠΕΡΔΙΚΑΚΗΣ ΕΜΜΑΝΟΥΗΛ","Γ.Σ.ΛΙΒΥΚΟΣ ΙΕΡΑΠΕΤΡΑΣ",11,null,null,11.003737290436376,3.7372904363756395E-3]
[11,null,37669,"ΜΑΡΑΚΗΣ ΜΙΧΑΗΛ","Ο.Α.ΧΑΝΙΩΝ",10.5,null,null,10.50022698813283,2.2698813283050239E-4]
[12,null,37990,"ΝΙΝΟΣ ΝΙΚΟΛΑΟΣ","Ο.Α.ΡΕΘΥΜΝΟΥ",7.5,null,null,7.5013869223427712,1.386922342771301E-3]
[13,null,37664,"ΚΑΫΜΕΝΑΚΗΣ ΑΡΙΣΤΟΤΕΛΗΣ","Ο.Α.ΧΑΝΙΩΝ",7.25,null,null,7.2510703441458517,1.0703441458513113E-3]
[14,null,33985,"ΤΣΙΤΟΥΝΗΣ ΜΙΧΑΛΗΣ","ΦΙΛΙΑ Τ.Κ.",5,null,null,5.0031120555962474,3.1120555962469614E-3]
[15,null,37471,"ΞΙΑΡΧΟΣ ΕΜΜΑΝΟΥΗΛ","Α.Ο.ΛΑΤΩ ΑΓ.ΝΙΚΟΛΑΟΥ",2.5,null,null,2.5033576960221438,3.357696022143745E-3]
[16,null,38697,"ΤΑΒΕΡΝΑΡΑΚΗΣ ΕΜΜΑΝΟΥΗΛ","ΗΡΑΚΛΕΙΟ Ο.Α.& Α.",2,null,null,2.0005722843110125,5.722843110124925E-4]
[17,null,33835,"ΒΕΓΟΠΟΥΛΟΣ ΧΑΡΑΛΑΜΠΟΣ","ΦΙΛΙΑ Τ.Κ.",1.5,null,null,1.5008721719894031,8.7217198940307264E-4]
[18,null,37805,"ΚΩΣΤΑΚΗΣ ΕΜΜΑΝΟΥΗΛ","ΗΡΑΚΛΕΙΟ Ο.Α.& Α.",1,null,null,1.0005531534998708,5.5315349987074584E-4]
[19,null,37562,"ΣΤΡΟΜΠΑ ΙΩΣΗΦ-ΛΑΥΡΕΝΤΗΣ","Ο.Α.ΧΑΝΙΩΝ",0,null,null,3.9756754636710969E-3,3.9756754636710969E-3]
[20,null,37801,"ΚΑΡΑΚΩΣΤΑΣ ΣΠΥΡΙΔΩΝ","ΗΡΑΚΛΕΙΟ Ο.Α.& Α.",0,null,null,2.6259899448252059E-3,2.6259899448252059E-3]
[21,null,38042,"ΜΠΟΥΝΑΚΗΣ ΔΗΜΗΤΡΙΟΣ","ΗΡΑΚΛΕΙΟ Ο.Α.& Α.",0,null,null,2.3190634468682509E-3,2.3190634468682509E-3]
[22,null,37800,"ΒΕΛΕΝΤΑΚΗΣ ΙΩΑΝΝΗΣ","ΗΡΑΚΛΕΙΟ Ο.Α.& Α.",0,null,null,2.2388702272682242E-3,2.2388702272682242E-3]
[23,null,38017,"ΝΕΚΤΑΡΙΟΣ ΑΘΑΝΑΣΙΟΣ","ΗΡΑΚΛΕΙΟ Ο.Α.& Α.",0,null,null,2.0073761189277777E-3,2.0073761189277777E-3]
[24,null,36616,"ΚΟΚΚΑΛΗΣ ΣΤΥΛΙΑΝΟΣ","Γ.Σ.ΛΙΒΥΚΟΣ ΙΕΡΑΠΕΤΡΑΣ",0,null,null,1.7765977383821226E-3,1.7765977383821226E-3]
[25,null,37803,"ΚΑΛΑΤΖΗΣ ΑΛΕΞΑΝΔΡΟΣ","ΗΡΑΚΛΕΙΟ Ο.Α.& Α.",0,null,null,1.6368810726075556E-3,1.6368810726075556E-3]
[26,null,37561,"ΦΟΥΝΤΟΥΛΑΚΗΣ ΝΙΚΟΛΑΟΣ","Ο.Α.ΧΑΝΙΩΝ",0,null,null,7.9731975291604982E-4,7.9731975291604982E-4]
[27,null,null,null,null,null,null,null,0,4.2857185400005658E-4]
[28,null,null,null,null,null,null,null,0,1.2625026270289661E-3]
[29,null,null,null,null,null,null,null,0,3.1044096754783953E-3]
[30,null,null,null,null,null,null,null,0,2.6234777040750365E-4]
[31,null,null,null,null,null,null,null,0,2.8952059832042252E-3]
[32,null,null,null,null,null,null,null,0,2.5870982399284021E-3]
[]
[]
[null,"Walk over",null,null,"med",null,null,"επιδιαιτητής"]
[null,"α/α","Α.Μ.","Ονοματεπώνυμο","Ν ή Ο",null,null,{"$f":"Setup!$B$11","v":"Κ. Χατζηδάκης"}]
[null,1,37862,"ΚΟΥΓΙΟΥΜΟΥΤΖΗΣ ΚΩΝΣΤΑΝΤΙΝΟΣ","Ο"]
[null,2]
[null,3]
[null,4]
[null,5]

{"sheet":"MD","index":2,"n_rows":66,"n_cols":24,"rows_kept":66,"cut":false,"hidden":false,"merged":[[0,0,0,20],[2,9,2,11],[40,20,40,23]]}
[{"$f":"Setup!B3 & \", \" & Setup!B4 & \", \" & Setup!B7 & \", \" & Setup!B9 & \"-\" & Setup!B10","v":"Ζ΄ ΕΝΩΣΗ, 3ο Ε3 2016, Γ.Σ. ΛΙΒΥΚΟΣ ΙΕΡΑΠ., 22-23 Οκτωβρίου "},null,null,null,null,null,null,null,null,null,null,null,null,null,null,null,null,null,null,null,null,null,null,{"$f":"Setup!B8","v":"Α12"}]
[null,{"$f":"Setup!B18","v":6}]
[null,null,null,null,null,null,null,null,null,32,null,null,null,null,16,null,null,8,null,null,4,null,null,"2 & w"]
["α/α",null,"ByeOrder","ByeSum","ByeCnt","από","seed","Pts","Α.Μ.","Ονοματεπώνυμο","επώνυμο","Σύλλογος"]
[1,1,null,null,0,{"$f":"IF(NOT($G5=\"-\"),VLOOKUP($G5,DrawPrep!$A$3:$F$34,2,FALSE),\"\")","v":0},{"$f":"VLOOKUP($B5,Setup!$K$2:$L$33,2,FALSE)","v":1},{"$f":"IF($G5>0,VLOOKUP($G5,DrawPrep!$A$3:$F$34,6,FALSE),0)","v":41},{"$f":"IF(Setup!$B$24=\"#\",0,IF($G5>0,VLOOKUP($G5,DrawPrep!$A$3:$F$34,3,FALSE),0))","v":31617},{"$f":"IF($I5>0,VLOOKUP($I5,DrawPrep!$C$3:$F$34,2,FALSE),\"bye\")","v":"ΜΑΤΣΑΜΑΚΗΣ ΕΛΕΥΘΕΡΙΟΣ"},{"$f":"IF(NOT(I5>0),\"\", IF(ISERROR(FIND(\"-\",J5)), LEFT(J5,FIND(\" \",J5)-1), IF(FIND(\"-\",J5)>FIND(\" \",J5),LEFT(J5,FIND(\" \",J5)-1), LEFT(J5,FIND(\"-\",J5)-1) )))","v":"ΜΑΤΣΑΜΑΚΗΣ"},{"$f":"IF($I5>0,VLOOKUP($I5,DrawPrep!$C$3:$F$34,3,FALSE),\"\")","v":"Ο.Α.ΧΑΝΙΩΝ"},1,{"$f":"IF((OR(M5=1,M5=2)),IF(M5=1,I5,I6),\"\")","v":31617},{"$f":"UPPER(IF($A$2=\"R\",IF(OR(M5=1,M5=\"a\"),I5,IF(OR(M5=2,M5=\"b\"),I6,\"\")),IF(OR(M5=1,M5=\"1\"),K5,IF(OR(M5=2,M5=\"b\"),K6,\"\"))))","v":"ΜΑΤΣΑΜΑΚΗΣ"}]
[2,{"$f":"1-D6+8","v":8},{"$f":"B5","v":1},{"$f":"E6","v":1},{"$f":"IF($B$2>=C6,1,0)","v":1},{"$f":"IF(NOT($G6=\"-\"),VLOOKUP($G6,DrawPrep!$A$3:$F$34,2,FALSE),\"\")","v":""},{"$f":"IF($B$2>=C6,\"-\",VLOOKUP($B6,Setup!$K$2:$L$33,2,FALSE))","v":"-"},{"$f":"IF(NOT($G6=\"-\"),VLOOKUP($G6,DrawPrep!$A$3:$F$34,6,FALSE),0)","v":0},{"$f":"IF(Setup!$B$24=\"#\",0,IF(NOT($G6=\"-\"),VLOOKUP($G6,DrawPrep!$A$3:$F$34,3,FALSE),0))","v":0},{"$f":"IF($I6>0,VLOOKUP($I6,DrawPrep!$C$3:$F$34,2,FALSE),\"bye\")","v":"bye"},{"$f":"IF(NOT(I6>0),\"\", IF(ISERROR(FIND(\"-\",J6)), LEFT(J6,FIND(\" \",J6)-1), IF(FIND(\"-\",J6)>FIND(\" \",J6),LEFT(J6,FIND(\" \",J6)-1), LEFT(J6,FIND(\"-\",J6)-1) )))","v":""},{"$f":"IF($I6>0,VLOOKUP($I6,DrawPrep!$C$3:$F$34,3,FALSE),\"\")","v":""},null,null,null,1,{"$f":"IF((OR(P6=1,P6=2)),IF(P6=1,N5,N7),\"\")","v":31617},{"$f":"UPPER(IF($A$2=\"R\",IF(OR(P6=1,P6=\"a\"),O5,IF(OR(P6=2,P6=\"b\"),O7,\"\")),IF(OR(P6=1,P6=\"a\"),O5,IF(OR(P6=2,P6=\"b\"),O7,\"\"))))","v":"ΜΑΤΣΑΜΑΚΗΣ"}]
[3,{"$f":"2-D7+8","v":9},null,{"$f":"D6+E7","v":1},0,{"$f":"IF(NOT($G7=\"-\"),VLOOKUP($G7,DrawPrep!$A$3:$F$34,2,FALSE),\"\")","v":0},{"$f":"VLOOKUP($B7,Setup!$K$2:$L$33,2,FALSE)","v":18},{"$f":"IF($G7>0,VLOOKUP($G7,DrawPrep!$A$3:$F$34,6,FALSE),0)","v":1},{"$f":"IF(Setup!$B$24=\"#\",0,IF($G7>0,VLOOKUP($G7,DrawPrep!$A$3:$F$34,3,FALSE),0))","v":37805},{"$f":"IF($I7>0,VLOOKUP($I7,DrawPrep!$C$3:$F$34,2,FALSE),\"bye\")","v":"ΚΩΣΤΑΚΗΣ ΕΜΜΑΝΟΥΗΛ"},"ΚΩΣΤΑΚΗΣ",{"$f":"IF($I7>0,VLOOKUP($I7,DrawPrep!$C$3:$F$34,3,FALSE),\"\")","v":"ΗΡΑΚΛΕΙΟ Ο.Α.& Α."},2,{"$f":"IF((OR(M7=1,M7=2)),IF(M7=1,I7,I8),\"\")","v":33295},{"$f":"UPPER(IF($A$2=\"R\",IF(OR(M7=1,M7=\"a\"),I7,IF(OR(M7=2,M7=\"b\"),I8,\"\")),IF(OR(M7=1,M7=\"a\"),K7,IF(OR(M7=2,M7=\"b\"),K8,\"\"))))","v":"ΒΟΛΤΥΡΑΚΗΣ"},null,null,"40 40"]
[4,{"$f":"3-D8+8","v":10},15,{"$f":"D7+E8","v":1},{"$f":"IF($B$2>=C8,1,0)","v":0},{"$f":"IF(NOT($G8=\"-\"),VLOOKUP($G8,DrawPrep!$A$3:$F$34,2,FALSE),\"\")","v":0},{"$f":"IF($B$2>=C8,\"-\",VLOOKUP($B8,Setup!$K$2:$L$33,2,FALSE))","v":9},{"$f":"IF(NOT($G8=\"-\"),VLOOKUP($G8,DrawPrep!$A$3:$F$34,6,FALSE),0)","v":13},{"$f":"IF(Setup!$B$24=\"#\",0,IF(NOT($G8=\"-\"),VLOOKUP($G8,DrawPrep!$A$3:$F$34,3,FALSE),0))","v":33295},{"$f":"IF($I8>0,VLOOKUP($I8,DrawPrep!$C$3:$F$34,2,FALSE),\"bye\")","v":"ΒΟΛΤΥΡΑΚΗΣ ΕΥΤΥΧΙΟΣ"},"ΒΟΛΤΥΡΑΚΗΣ",{"$f":"IF($I8>0,VLOOKUP($I8,DrawPrep!$C$3:$F$34,3,FALSE),\"\")","v":"Ο.Α.ΧΑΝΙΩΝ"},null,null,"54(4) 42",null,null,null,1,{"$f":"IF((OR(S8=1,S8=2)),IF(S8=1,Q6,Q10),\"\")","v":31617},{"$f":"UPPER(IF($A$2=\"R\",IF(OR(S8=1,S8=\"a\"),R6,IF(OR(S8=2,S8=\"b\"),R10,\"\")),IF(OR(S8=1,S8=\"a\"),R6,IF(OR(S8=2,S8=\"b\"),R10,\"\"))))","v":"ΜΑΤΣΑΜΑΚΗΣ"}]
[5,{"$f":"4-D9+8","v":11},null,1,0,{"$f":"IF(NOT($G9=\"-\"),VLOOKUP($G9,DrawPrep!$A$3:$F$34,2,FALSE),\"\")","v":0},{"$f":"VLOOKUP($B9,Setup!$K$2:$L$33,2,FALSE)","v":10},{"$f":"IF($G9>0,VLOOKUP($G9,DrawPrep!$A$3:$F$34,6,FALSE),0)","v":11},{"$f":"IF(Setup!$B$24=\"#\",0,IF($G9>0,VLOOKUP($G9,DrawPrep!$A$3:$F$34,3,FALSE),0))","v":36550},{"$f":"IF($I9>0,VLOOKUP($I9,DrawPrep!$C$3:$F$34,2,FALSE),\"bye\")","v":"ΠΕΡΔΙΚΑΚΗΣ ΕΜΜΑΝΟΥΗΛ"},"ΠΕΡΔΙΚΑΚΗΣ",{"$f":"IF($I9>0,VLOOKUP($I9,DrawPrep!$C$3:$F$34,3,FALSE),\"\")","v":"Γ.Σ.ΛΙΒΥΚΟΣ ΙΕΡΑΠΕΤΡΑΣ"},1,{"$f":"IF((OR(M9=1,M9=2)),IF(M9=1,I9,I10),\"\")","v":36550},{"$f":"UPPER(IF($A$2=\"R\",IF(OR(M9=1,M9=\"a\"),I9,IF(OR(M9=2,M9=\"b\"),I10,\"\")),IF(OR(M9=1,M9=\"a\"),K9,IF(OR(M9=2,M9=\"b\"),K10,\"\"))))","v":"ΠΕΡΔΙΚΑΚΗΣ"},null,null,null,null,null,"40 41"]
[6,{"$f":"5-D10+8","v":12},9,1,{"$f":"IF($B$2>=C10,1,0)","v":0},{"$f":"IF(NOT($G10=\"-\"),VLOOKUP($G10,DrawPrep!$A$3:$F$34,2,FALSE),\"\")","v":0},{"$f":"IF($B$2>=C10,\"-\",VLOOKUP($B10,Setup!$K$2:$L$33,2,FALSE))","v":26},{"$f":"IF(NOT($G10=\"-\"),VLOOKUP($G10,DrawPrep!$A$3:$F$34,6,FALSE),0)","v":0},{"$f":"IF(Setup!$B$24=\"#\",0,IF(NOT($G10=\"-\"),VLOOKUP($G10,DrawPrep!$A$3:$F$34,3,FALSE),0))","v":37561},{"$f":"IF($I10>0,VLOOKUP($I10,DrawPrep!$C$3:$F$34,2,FALSE),\"bye\")","v":"ΦΟΥΝΤΟΥΛΑΚΗΣ ΝΙΚΟΛΑΟΣ"},"ΦΟΥΝΤΟΥΛΑΚΗΣ",{"$f":"IF($I10>0,VLOOKUP($I10,DrawPrep!$C$3:$F$34,3,FALSE),\"\")","v":"Ο.Α.ΧΑΝΙΩΝ"},null,null,"40 30 ret",2,{"$f":"IF((OR(P10=1,P10=2)),IF(P10=1,N9,N11),\"\")","v":32350},{"$f":"UPPER(IF($A$2=\"R\",IF(OR(P10=1,P10=\"a\"),O9,IF(OR(P10=2,P10=\"b\"),O11,\"\")),IF(OR(P10=1,P10=\"a\"),O9,IF(OR(P10=2,P10=\"b\"),O11,\"\"))))","v":"ΠΕΤΡΑΚΗΣ"},null,null," "]
[7,{"$f":"6-D11+8","v":12},{"$f":"B12","v":6},2,{"$f":"IF($B$2>=C11,1,0)","v":1},{"$f":"IF(NOT($G11=\"-\"),VLOOKUP($G11,DrawPrep!$A$3:$F$34,2,FALSE),\"\")","v":""},{"$f":"IF($B$2>=C11,\"-\",VLOOKUP($B11,Setup!$K$2:$L$33,2,FALSE))","v":"-"},{"$f":"IF(NOT($G11=\"-\"),VLOOKUP($G11,DrawPrep!$A$3:$F$34,6,FALSE),0)","v":0},{"$f":"IF(Setup!$B$24=\"#\",0,IF(NOT($G11=\"-\"),VLOOKUP($G11,DrawPrep!$A$3:$F$34,3,FALSE),0))","v":0},{"$f":"IF($I11>0,VLOOKUP($I11,DrawPrep!$C$3:$F$34,2,FALSE),\"bye\")","v":"bye"},"",{"$f":"IF($I11>0,VLOOKUP($I11,DrawPrep!$C$3:$F$34,3,FALSE),\"\")","v":""},2,{"$f":"IF((OR(M11=1,M11=2)),IF(M11=1,I11,I12),\"\")","v":32350},{"$f":"UPPER(IF($A$2=\"R\",IF(OR(M11=1,M11=\"a\"),I11,IF(OR(M11=2,M11=\"b\"),I12,\"\")),IF(OR(M11=1,M11=\"a\"),K11,IF(OR(M11=2,M11=\"b\"),K12,\"\"))))","v":"ΠΕΤΡΑΚΗΣ"},null,null,"42 41"]
[8,{"$f":"VALUE(Setup!E5)","v":6},null,2,0,{"$f":"IF(NOT($G12=\"-\"),VLOOKUP($G12,DrawPrep!$A$3:$F$34,2,FALSE),\"\")","v":0},{"$f":"VLOOKUP($B12,Setup!$K$2:$L$33,2,FALSE)","v":6},{"$f":"IF($G12>0,VLOOKUP($G12,DrawPrep!$A$3:$F$34,6,FALSE),0)","v":17.5},{"$f":"IF(Setup!$B$24=\"#\",0,IF($G12>0,VLOOKUP($G12,DrawPrep!$A$3:$F$34,3,FALSE),0))","v":32350},{"$f":"IF($I12>0,VLOOKUP($I12,DrawPrep!$C$3:$F$34,2,FALSE),\"bye\")","v":"ΠΕΤΡΑΚΗΣ ΣΤΥΛΙΑΝΟΣ"},"ΠΕΤΡΑΚΗΣ",{"$f":"IF($I12>0,VLOOKUP($I12,DrawPrep!$C$3:$F$34,3,FALSE),\"\")","v":"Ο.Α.ΧΑΝΙΩΝ"},null,null,null,null,null,null,null,null,null,1,{"$f":"IF((OR(V12=1,V12=2)),IF(V12=1,T8,T16),\"\")","v":31617},{"$f":"UPPER(IF($A$2=\"R\",IF(OR(V12=1,V12=\"a\"),U8,IF(OR(V12=2,V12=\"b\"),U16,\"\")),IF(OR(V12=1,V12=\"a\"),U8,IF(OR(V12=2,V12=\"b\"),U16,\"\"))))","v":"ΜΑΤΣΑΜΑΚΗΣ"}]
[9,{"$f":"VALUE(Setup!E2)","v":3},null,2,0,{"$f":"IF(NOT($G13=\"-\"),VLOOKUP($G13,DrawPrep!$A$3:$F$34,2,FALSE),\"\")","v":0},{"$f":"VLOOKUP($B13,Setup!$K$2:$L$33,2,FALSE)","v":3},{"$f":"IF($G13>0,VLOOKUP($G13,DrawPrep!$A$3:$F$34,6,FALSE),0)","v":26},{"$f":"IF(Setup!$B$24=\"#\",0,IF($G13>0,VLOOKUP($G13,DrawPrep!$A$3:$F$34,3,FALSE),0))","v":36456},{"$f":"IF($I13>0,VLOOKUP($I13,DrawPrep!$C$3:$F$34,2,FALSE),\"bye\")","v":"ΓΕΝΝΑΡΑΚΗΣ ΝΙΚΟΛΑΟΣ"},"ΓΕΝΝΑΡΑΚΗΣ",{"$f":"IF($I13>0,VLOOKUP($I13,DrawPrep!$C$3:$F$34,3,FALSE),\"\")","v":"ΗΡΑΚΛΕΙΟ Ο.Α.& Α."},1,{"$f":"IF((OR(M13=1,M13=2)),IF(M13=1,I13,I14),\"\")","v":36456},{"$f":"UPPER(IF($A$2=\"R\",IF(OR(M13=1,M13=\"a\"),I13,IF(OR(M13=2,M13=\"b\"),I14,\"\")),IF(OR(M13=1,M13=\"a\"),K13,IF(OR(M13=2,M13=\"b\"),K14,\"\"))))","v":"ΓΕΝΝΑΡΑΚΗΣ"},null,null,null,null,null,null,null,null,"61 63"]
[10,{"$f":"7-D14+8","v":12},{"$f":"B13","v":3},3,{"$f":"IF($B$2>=C14,1,0)","v":1},{"$f":"IF(NOT($G14=\"-\"),VLOOKUP($G14,DrawPrep!$A$3:$F$34,2,FALSE),\"\")","v":""},{"$f":"IF($B$2>=C14,\"-\",VLOOKUP($B14,Setup!$K$2:$L$33,2,FALSE))","v":"-"},{"$f":"IF(NOT($G14=\"-\"),VLOOKUP($G14,DrawPrep!$A$3:$F$34,6,FALSE),0)","v":0},{"$f":"IF(Setup!$B$24=\"#\",0,IF(NOT($G14=\"-\"),VLOOKUP($G14,DrawPrep!$A$3:$F$34,3,FALSE),0))","v":0},{"$f":"IF($I14>0,VLOOKUP($I14,DrawPrep!$C$3:$F$34,2,FALSE),\"bye\")","v":"bye"},"",{"$f":"IF($I14>0,VLOOKUP($I14,DrawPrep!$C$3:$F$34,3,FALSE),\"\")","v":""},null,null,null,1,{"$f":"IF((OR(P14=1,P14=2)),IF(P14=1,N13,N15),\"\")","v":36456},{"$f":"UPPER(IF($A$2=\"R\",IF(OR(P14=1,P14=\"a\"),O13,IF(OR(P14=2,P14=\"b\"),O15,\"\")),IF(OR(P14=1,P14=\"a\"),O13,IF(OR(P14=2,P14=\"b\"),O15,\"\"))))","v":"ΓΕΝΝΑΡΑΚΗΣ"}]
[11,{"$f":"8-D15+8","v":13},null,3,0,{"$f":"IF(NOT($G15=\"-\"),VLOOKUP($G15,DrawPrep!$A$3:$F$34,2,FALSE),\"\")","v":0},{"$f":"VLOOKUP($B15,Setup!$K$2:$L$33,2,FALSE)","v":21},{"$f":"IF($G15>0,VLOOKUP($G15,DrawPrep!$A$3:$F$34,6,FALSE),0)","v":0},{"$f":"IF(Setup!$B$24=\"#\",0,IF($G15>0,VLOOKUP($G15,DrawPrep!$A$3:$F$34,3,FALSE),0))","v":38042},{"$f":"IF($I15>0,VLOOKUP($I15,DrawPrep!$C$3:$F$34,2,FALSE),\"bye\")","v":"ΜΠΟΥΝΑΚΗΣ ΔΗΜΗΤΡΙΟΣ"},"ΜΠΟΥΝΑΚΗΣ",{"$f":"IF($I15>0,VLOOKUP($I15,DrawPrep!$C$3:$F$34,3,FALSE),\"\")","v":"ΗΡΑΚΛΕΙΟ Ο.Α.& Α."},1,{"$f":"IF((OR(M15=1,M15=2)),IF(M15=1,I15,I16),\"\")","v":38042},{"$f":"UPPER(IF($A$2=\"R\",IF(OR(M15=1,M15=\"a\"),I15,IF(OR(M15=2,M15=\"b\"),I16,\"\")),IF(OR(M15=1,M15=\"a\"),K15,IF(OR(M15=2,M15=\"b\"),K16,\"\"))))","v":"ΜΠΟΥΝΑΚΗΣ"},null,null,"42 40"]
[12,{"$f":"9-D16+8","v":14},13,3,{"$f":"IF($B$2>=C16,1,0)","v":0},{"$f":"IF(NOT($G16=\"-\"),VLOOKUP($G16,DrawPrep!$A$3:$F$34,2,FALSE),\"\")","v":0},{"$f":"IF($B$2>=C16,\"-\",VLOOKUP($B16,Setup!$K$2:$L$33,2,FALSE))","v":25},{"$f":"IF(NOT($G16=\"-\"),VLOOKUP($G16,DrawPrep!$A$3:$F$34,6,FALSE),0)","v":0},{"$f":"IF(Setup!$B$24=\"#\",0,IF(NOT($G16=\"-\"),VLOOKUP($G16,DrawPrep!$A$3:$F$34,3,FALSE),0))","v":37803},{"$f":"IF($I16>0,VLOOKUP($I16,DrawPrep!$C$3:$F$34,2,FALSE),\"bye\")","v":"ΚΑΛΑΤΖΗΣ ΑΛΕΞΑΝΔΡΟΣ"},"ΚΑΛΑΤΖΗΣ",{"$f":"IF($I16>0,VLOOKUP($I16,DrawPrep!$C$3:$F$34,3,FALSE),\"\")","v":"ΗΡΑΚΛΕΙΟ Ο.Α.& Α."},null,null,"53 54(4)",null,null,null,1,{"$f":"IF((OR(S16=1,S16=2)),IF(S16=1,Q14,Q18),\"\")","v":36456},{"$f":"UPPER(IF($A$2=\"R\",IF(OR(S16=1,S16=\"a\"),R14,IF(OR(S16=2,S16=\"b\"),R18,\"\")),IF(OR(S16=1,S16=\"a\"),R14,IF(OR(S16=2,S16=\"b\"),R18,\"\"))))","v":"ΓΕΝΝΑΡΑΚΗΣ"}]
[13,{"$f":"10-D17+8","v":15},null,3,0,{"$f":"IF(NOT($G17=\"-\"),VLOOKUP($G17,DrawPrep!$A$3:$F$34,2,FALSE),\"\")","v":0},{"$f":"VLOOKUP($B17,Setup!$K$2:$L$33,2,FALSE)","v":20},{"$f":"IF($G17>0,VLOOKUP($G17,DrawPrep!$A$3:$F$34,6,FALSE),0)","v":0},{"$f":"IF(Setup!$B$24=\"#\",0,IF($G17>0,VLOOKUP($G17,DrawPrep!$A$3:$F$34,3,FALSE),0))","v":37801},{"$f":"IF($I17>0,VLOOKUP($I17,DrawPrep!$C$3:$F$34,2,FALSE),\"bye\")","v":"ΚΑΡΑΚΩΣΤΑΣ ΣΠΥΡΙΔΩΝ"},"ΚΑΡΑΚΩΣΤΑΣ",{"$f":"IF($I17>0,VLOOKUP($I17,DrawPrep!$C$3:$F$34,3,FALSE),\"\")","v":"ΗΡΑΚΛΕΙΟ Ο.Α.& Α."},1,{"$f":"IF((OR(M17=1,M17=2)),IF(M17=1,I17,I18),\"\")","v":37801},{"$f":"UPPER(IF($A$2=\"R\",IF(OR(M17=1,M17=\"a\"),I17,IF(OR(M17=2,M17=\"b\"),I18,\"\")),IF(OR(M17=1,M17=\"a\"),K17,IF(OR(M17=2,M17=\"b\"),K18,\"\"))))","v":"ΚΑΡΑΚΩΣΤΑΣ"},null,null,null,null,null,"54(10) 53"]
[14,{"$f":"11-D18+8","v":16},11,3,{"$f":"IF($B$2>=C18,1,0)","v":0},{"$f":"IF(NOT($G18=\"-\"),VLOOKUP($G18,DrawPrep!$A$3:$F$34,2,FALSE),\"\")","v":0},{"$f":"IF($B$2>=C18,\"-\",VLOOKUP($B18,Setup!$K$2:$L$33,2,FALSE))","v":22},{"$f":"IF(NOT($G18=\"-\"),VLOOKUP($G18,DrawPrep!$A$3:$F$34,6,FALSE),0)","v":0},{"$f":"IF(Setup!$B$24=\"#\",0,IF(NOT($G18=\"-\"),VLOOKUP($G18,DrawPrep!$A$3:$F$34,3,FALSE),0))","v":37800},{"$f":"IF($I18>0,VLOOKUP($I18,DrawPrep!$C$3:$F$34,2,FALSE),\"bye\")","v":"ΒΕΛΕΝΤΑΚΗΣ ΙΩΑΝΝΗΣ"},"ΒΕΛΕΝΤΑΚΗΣ",{"$f":"IF($I18>0,VLOOKUP($I18,DrawPrep!$C$3:$F$34,3,FALSE),\"\")","v":"ΗΡΑΚΛΕΙΟ Ο.Α.& Α."},null,null,"40 40",2,{"$f":"IF((OR(P18=1,P18=2)),IF(P18=1,N17,N19),\"\")","v":37665},{"$f":"UPPER(IF($A$2=\"R\",IF(OR(P18=1,P18=\"a\"),O17,IF(OR(P18=2,P18=\"b\"),O19,\"\")),IF(OR(P18=1,P18=\"a\"),O17,IF(OR(P18=2,P18=\"b\"),O19,\"\"))))","v":"ΚΟΚΚΙΝΑΚΗΣ"}]
[15,{"$f":"12-D19+8","v":17},{"$f":"B20","v":7},3,{"$f":"IF($B$2>=C19,1,0)","v":0},{"$f":"IF(NOT($G19=\"-\"),VLOOKUP($G19,DrawPrep!$A$3:$F$34,2,FALSE),\"\")","v":0},{"$f":"IF($B$2>=C19,\"-\",VLOOKUP($B19,Setup!$K$2:$L$33,2,FALSE))","v":12},{"$f":"IF(NOT($G19=\"-\"),VLOOKUP($G19,DrawPrep!$A$3:$F$34,6,FALSE),0)","v":7.5},{"$f":"IF(Setup!$B$24=\"#\",0,IF(NOT($G19=\"-\"),VLOOKUP($G19,DrawPrep!$A$3:$F$34,3,FALSE),0))","v":37990},{"$f":"IF($I19>0,VLOOKUP($I19,DrawPrep!$C$3:$F$34,2,FALSE),\"bye\")","v":"ΝΙΝΟΣ ΝΙΚΟΛΑΟΣ"},"ΝΙΝΟΣ",{"$f":"IF($I19>0,VLOOKUP($I19,DrawPrep!$C$3:$F$34,3,FALSE),\"\")","v":"Ο.Α.ΡΕΘΥΜΝΟΥ"},2,{"$f":"IF((OR(M19=1,M19=2)),IF(M19=1,I19,I20),\"\")","v":37665},{"$f":"UPPER(IF($A$2=\"R\",IF(OR(M19=1,M19=\"a\"),I19,IF(OR(M19=2,M19=\"b\"),I20,\"\")),IF(OR(M19=1,M19=\"a\"),K19,IF(OR(M19=2,M19=\"b\"),K20,\"\"))))","v":"ΚΟΚΚΙΝΑΚΗΣ"},null,null,"40 41"]
[16,{"$f":"VALUE(Setup!E6)","v":7},null,3,0,{"$f":"IF(NOT($G20=\"-\"),VLOOKUP($G20,DrawPrep!$A$3:$F$34,2,FALSE),\"\")","v":0},{"$f":"VLOOKUP($B20,Setup!$K$2:$L$33,2,FALSE)","v":7},{"$f":"IF($G20>0,VLOOKUP($G20,DrawPrep!$A$3:$F$34,6,FALSE),0)","v":17},{"$f":"IF(Setup!$B$24=\"#\",0,IF($G20>0,VLOOKUP($G20,DrawPrep!$A$3:$F$34,3,FALSE),0))","v":37665},{"$f":"IF($I20>0,VLOOKUP($I20,DrawPrep!$C$3:$F$34,2,FALSE),\"bye\")","v":"ΚΟΚΚΙΝΑΚΗΣ ΓΕΩΡΓΙΟΣ"},"ΚΟΚΚΙΝΑΚΗΣ",{"$f":"IF($I20>0,VLOOKUP($I20,DrawPrep!$C$3:$F$34,3,FALSE),\"\")","v":"Ο.Α.ΧΑΝΙΩΝ"},null,null,4040,null,null,null,null,null,null,1,{"$f":"IF((OR(V20=1,V20=2)),IF(V20=1,W12,W28),\"\")","v":31617},{"$f":"UPPER(IF($A$2=\"R\",IF(OR(V20=1,V20=\"a\"),X12,IF(OR(V20=2,V20=\"b\"),X28,\"\")),IF(OR(V20=1,V20=\"a\"),X12,IF(OR(V20=2,V20=\"b\"),X28,\"\"))))","v":"ΜΑΤΣΑΜΑΚΗΣ"}]
[17,{"$f":"VALUE(Setup!E7)","v":5},null,3,0,{"$f":"IF(NOT($G21=\"-\"),VLOOKUP($G21,DrawPrep!$A$3:$F$34,2,FALSE),\"\")","v":0},{"$f":"VLOOKUP($B21,Setup!$K$2:$L$33,2,FALSE)","v":5},{"$f":"IF($G21>0,VLOOKUP($G21,DrawPrep!$A$3:$F$34,6,FALSE),0)","v":19.5},{"$f":"IF(Setup!$B$24=\"#\",0,IF($G21>0,VLOOKUP($G21,DrawPrep!$A$3:$F$34,3,FALSE),0))","v":37032},{"$f":"IF($I21>0,VLOOKUP($I21,DrawPrep!$C$3:$F$34,2,FALSE),\"bye\")","v":"ΧΑΛΑΚΑΤΕΒΑΚΗΣ ΑΠΟΣΤΟΛΟΣ"},"ΧΑΛΑΚΑΤΕΒΑΚΗΣ",{"$f":"IF($I21>0,VLOOKUP($I21,DrawPrep!$C$3:$F$34,3,FALSE),\"\")","v":"Ο.Α.ΧΑΝΙΩΝ"},1,{"$f":"IF((OR(M21=1,M21=2)),IF(M21=1,I21,I22),\"\")","v":37032},{"$f":"UPPER(IF($A$2=\"R\",IF(OR(M21=1,M21=\"a\"),I21,IF(OR(M21=2,M21=\"b\"),I22,\"\")),IF(OR(M21=1,M21=\"a\"),K21,IF(OR(M21=2,M21=\"b\"),K22,\"\"))))","v":"ΧΑΛΑΚΑΤΕΒΑΚΗΣ"},null,null,null,null,null,null,null,null,"62 62"]
[18,{"$f":"13-D22+8","v":17},{"$f":"B21","v":5},4,{"$f":"IF($B$2>=C22,1,0)","v":1},{"$f":"IF(NOT($G22=\"-\"),VLOOKUP($G22,DrawPrep!$A$3:$F$34,2,FALSE),\"\")","v":""},{"$f":"IF($B$2>=C22,\"-\",VLOOKUP($B22,Setup!$K$2:$L$33,2,FALSE))","v":"-"},{"$f":"IF(NOT($G22=\"-\"),VLOOKUP($G22,DrawPrep!$A$3:$F$34,6,FALSE),0)","v":0},{"$f":"IF(Setup!$B$24=\"#\",0,IF(NOT($G22=\"-\"),VLOOKUP($G22,DrawPrep!$A$3:$F$34,3,FALSE),0))","v":0},{"$f":"IF($I22>0,VLOOKUP($I22,DrawPrep!$C$3:$F$34,2,FALSE),\"bye\")","v":"bye"},"",{"$f":"IF($I22>0,VLOOKUP($I22,DrawPrep!$C$3:$F$34,3,FALSE),\"\")","v":""},null,null,null,2,{"$f":"IF((OR(P22=1,P22=2)),IF(P22=1,N21,N23),\"\")","v":37562},{"$f":"UPPER(IF($A$2=\"R\",IF(OR(P22=1,P22=\"a\"),O21,IF(OR(P22=2,P22=\"b\"),O23,\"\")),IF(OR(P22=1,P22=\"a\"),O21,IF(OR(P22=2,P22=\"b\"),O23,\"\"))))","v":"ΣΤΡΟΜΠΑ"}]
[19,{"$f":"14-D23+8","v":18},null,4,0,{"$f":"IF(NOT($G23=\"-\"),VLOOKUP($G23,DrawPrep!$A$3:$F$34,2,FALSE),\"\")","v":0},{"$f":"VLOOKUP($B23,Setup!$K$2:$L$33,2,FALSE)","v":19},{"$f":"IF($G23>0,VLOOKUP($G23,DrawPrep!$A$3:$F$34,6,FALSE),0)","v":0},{"$f":"IF(Setup!$B$24=\"#\",0,IF($G23>0,VLOOKUP($G23,DrawPrep!$A$3:$F$34,3,FALSE),0))","v":37562},{"$f":"IF($I23>0,VLOOKUP($I23,DrawPrep!$C$3:$F$34,2,FALSE),\"bye\")","v":"ΣΤΡΟΜΠΑ ΙΩΣΗΦ-ΛΑΥΡΕΝΤΗΣ"},"ΣΤΡΟΜΠΑ",{"$f":"IF($I23>0,VLOOKUP($I23,DrawPrep!$C$3:$F$34,3,FALSE),\"\")","v":"Ο.Α.ΧΑΝΙΩΝ"},1,{"$f":"IF((OR(M23=1,M23=2)),IF(M23=1,I23,I24),\"\")","v":37562},{"$f":"UPPER(IF($A$2=\"R\",IF(OR(M23=1,M23=\"a\"),I23,IF(OR(M23=2,M23=\"b\"),I24,\"\")),IF(OR(M23=1,M23=\"a\"),K23,IF(OR(M23=2,M23=\"b\"),K24,\"\"))))","v":"ΣΤΡΟΜΠΑ"},null,null,"42 14 (10-8)"]
[20,{"$f":"15-D24+8","v":19},12,4,{"$f":"IF($B$2>=C24,1,0)","v":0},{"$f":"IF(NOT($G24=\"-\"),VLOOKUP($G24,DrawPrep!$A$3:$F$34,2,FALSE),\"\")","v":0},{"$f":"IF($B$2>=C24,\"-\",VLOOKUP($B24,Setup!$K$2:$L$33,2,FALSE))","v":17},{"$f":"IF(NOT($G24=\"-\"),VLOOKUP($G24,DrawPrep!$A$3:$F$34,6,FALSE),0)","v":1.5},{"$f":"IF(Setup!$B$24=\"#\",0,IF(NOT($G24=\"-\"),VLOOKUP($G24,DrawPrep!$A$3:$F$34,3,FALSE),0))","v":33835},{"$f":"IF($I24>0,VLOOKUP($I24,DrawPrep!$C$3:$F$34,2,FALSE),\"bye\")","v":"ΒΕΓΟΠΟΥΛΟΣ ΧΑΡΑΛΑΜΠΟΣ"},"ΒΕΓΟΠΟΥΛΟΣ",{"$f":"IF($I24>0,VLOOKUP($I24,DrawPrep!$C$3:$F$34,3,FALSE),\"\")","v":"ΦΙΛΙΑ Τ.Κ."},null,null,"40 42",null,null,null,2,{"$f":"IF((OR(S24=1,S24=2)),IF(S24=1,Q22,Q26),\"\")","v":33396},{"$f":"UPPER(IF($A$2=\"R\",IF(OR(S24=1,S24=\"a\"),R22,IF(OR(S24=2,S24=\"b\"),R26,\"\")),IF(OR(S24=1,S24=\"a\"),R22,IF(OR(S24=2,S24=\"b\"),R26,\"\"))))","v":"ΖΕΡΒΟΣ"}]
[21,{"$f":"16-D25+8","v":20},null,4,0,{"$f":"IF(NOT($G25=\"-\"),VLOOKUP($G25,DrawPrep!$A$3:$F$34,2,FALSE),\"\")","v":0},{"$f":"VLOOKUP($B25,Setup!$K$2:$L$33,2,FALSE)","v":11},{"$f":"IF($G25>0,VLOOKUP($G25,DrawPrep!$A$3:$F$34,6,FALSE),0)","v":10.5},{"$f":"IF(Setup!$B$24=\"#\",0,IF($G25>0,VLOOKUP($G25,DrawPrep!$A$3:$F$34,3,FALSE),0))","v":37669},{"$f":"IF($I25>0,VLOOKUP($I25,DrawPrep!$C$3:$F$34,2,FALSE),\"bye\")","v":"ΜΑΡΑΚΗΣ ΜΙΧΑΗΛ"},"ΜΑΡΑΚΗΣ",{"$f":"IF($I25>0,VLOOKUP($I25,DrawPrep!$C$3:$F$34,3,FALSE),\"\")","v":"Ο.Α.ΧΑΝΙΩΝ"},1,{"$f":"IF((OR(M25=1,M25=2)),IF(M25=1,I25,I26),\"\")","v":37669},{"$f":"UPPER(IF($A$2=\"R\",IF(OR(M25=1,M25=\"a\"),I25,IF(OR(M25=2,M25=\"b\"),I26,\"\")),IF(OR(M25=1,M25=\"a\"),K25,IF(OR(M25=2,M25=\"b\"),K26,\"\"))))","v":"ΜΑΡΑΚΗΣ"},null,null,null,null,null,"40 41"]
[22,{"$f":"17-D26+8","v":21},14,4,{"$f":"IF($B$2>=C26,1,0)","v":0},{"$f":"IF(NOT($G26=\"-\"),VLOOKUP($G26,DrawPrep!$A$3:$F$34,2,FALSE),\"\")","v":0},{"$f":"IF($B$2>=C26,\"-\",VLOOKUP($B26,Setup!$K$2:$L$33,2,FALSE))","v":15},{"$f":"IF(NOT($G26=\"-\"),VLOOKUP($G26,DrawPrep!$A$3:$F$34,6,FALSE),0)","v":2.5},{"$f":"IF(Setup!$B$24=\"#\",0,IF(NOT($G26=\"-\"),VLOOKUP($G26,DrawPrep!$A$3:$F$34,3,FALSE),0))","v":37471},{"$f":"IF($I26>0,VLOOKUP($I26,DrawPrep!$C$3:$F$34,2,FALSE),\"bye\")","v":"ΞΙΑΡΧΟΣ ΕΜΜΑΝΟΥΗΛ"},"ΞΙΑΡΧΟΣ",{"$f":"IF($I26>0,VLOOKUP($I26,DrawPrep!$C$3:$F$34,3,FALSE),\"\")","v":"Α.Ο.ΛΑΤΩ ΑΓ.ΝΙΚΟΛΑΟΥ"},null,null,"40 54(0)",2,{"$f":"IF((OR(P26=1,P26=2)),IF(P26=1,N25,N27),\"\")","v":33396},{"$f":"UPPER(IF($A$2=\"R\",IF(OR(P26=1,P26=\"a\"),O25,IF(OR(P26=2,P26=\"b\"),O27,\"\")),IF(OR(P26=1,P26=\"a\"),O25,IF(OR(P26=2,P26=\"b\"),O27,\"\"))))","v":"ΖΕΡΒΟΣ"}]
[23,{"$f":"18-D27+8","v":21},{"$f":"B28","v":4},5,{"$f":"IF($B$2>=C27,1,0)","v":1},{"$f":"IF(NOT($G27=\"-\"),VLOOKUP($G27,DrawPrep!$A$3:$F$34,2,FALSE),\"\")","v":""},{"$f":"IF($B$2>=C27,\"-\",VLOOKUP($B27,Setup!$K$2:$L$33,2,FALSE))","v":"-"},{"$f":"IF(NOT($G27=\"-\"),VLOOKUP($G27,DrawPrep!$A$3:$F$34,6,FALSE),0)","v":0},{"$f":"IF(Setup!$B$24=\"#\",0,IF(NOT($G27=\"-\"),VLOOKUP($G27,DrawPrep!$A$3:$F$34,3,FALSE),0))","v":0},{"$f":"IF($I27>0,VLOOKUP($I27,DrawPrep!$C$3:$F$34,2,FALSE),\"bye\")","v":"bye"},"",{"$f":"IF($I27>0,VLOOKUP($I27,DrawPrep!$C$3:$F$34,3,FALSE),\"\")","v":""},2,{"$f":"IF((OR(M27=1,M27=2)),IF(M27=1,I27,I28),\"\")","v":33396},{"$f":"UPPER(IF($A$2=\"R\",IF(OR(M27=1,M27=\"a\"),I27,IF(OR(M27=2,M27=\"b\"),I28,\"\")),IF(OR(M27=1,M27=\"a\"),K27,IF(OR(M27=2,M27=\"b\"),K28,\"\"))))","v":"ΖΕΡΒΟΣ"},null,null,"41 42"]
[24,{"$f":"VALUE(Setup!E3)","v":4},null,5,0,{"$f":"IF(NOT($G28=\"-\"),VLOOKUP($G28,DrawPrep!$A$3:$F$34,2,FALSE),\"\")","v":0},{"$f":"VLOOKUP($B28,Setup!$K$2:$L$33,2,FALSE)","v":4},{"$f":"IF($G28>0,VLOOKUP($G28,DrawPrep!$A$3:$F$34,6,FALSE),0)","v":21.5},{"$f":"IF(Setup!$B$24=\"#\",0,IF($G28>0,VLOOKUP($G28,DrawPrep!$A$3:$F$34,3,FALSE),0))","v":33396},{"$f":"IF($I28>0,VLOOKUP($I28,DrawPrep!$C$3:$F$34,2,FALSE),\"bye\")","v":"ΖΕΡΒΟΣ ΣΤΥΛΙΑΝΟΣ"},"ΖΕΡΒΟΣ",{"$f":"IF($I28>0,VLOOKUP($I28,DrawPrep!$C$3:$F$34,3,FALSE),\"\")","v":"Ο.Α.ΧΑΝΙΩΝ"},null,null,null,null,null,null,null,null,null,2,{"$f":"IF((OR(V28=1,V28=2)),IF(V28=1,T24,T32),\"\")","v":36263},{"$f":"UPPER(IF($A$2=\"R\",IF(OR(V28=1,V28=\"a\"),U24,IF(OR(V28=2,V28=\"b\"),U32,\"\")),IF(OR(V28=1,V28=\"a\"),U24,IF(OR(V28=2,V28=\"b\"),U32,\"\"))))","v":"ΜΑΝΔΑΛΕΝΑΚΗΣ"}]
[25,{"$f":"VALUE(Setup!E8)","v":8},null,5,0,{"$f":"IF(NOT($G29=\"-\"),VLOOKUP($G29,DrawPrep!$A$3:$F$34,2,FALSE),\"\")","v":0},{"$f":"VLOOKUP($B29,Setup!$K$2:$L$33,2,FALSE)","v":8},{"$f":"IF($G29>0,VLOOKUP($G29,DrawPrep!$A$3:$F$34,6,FALSE),0)","v":14.5},{"$f":"IF(Setup!$B$24=\"#\",0,IF($G29>0,VLOOKUP($G29,DrawPrep!$A$3:$F$34,3,FALSE),0))","v":35629},{"$f":"IF($I29>0,VLOOKUP($I29,DrawPrep!$C$3:$F$34,2,FALSE),\"bye\")","v":"ΣΠΥΡΟΠΟΥΛΟΣ ΝΙΚΟΛΑΟΣ"},"ΣΠΥΡΟΠΟΥΛΟΣ",{"$f":"IF($I29>0,VLOOKUP($I29,DrawPrep!$C$3:$F$34,3,FALSE),\"\")","v":"Ο.Α.ΡΕΘΥΜΝΟΥ"},1,{"$f":"IF((OR(M29=1,M29=2)),IF(M29=1,I29,I30),\"\")","v":35629},{"$f":"UPPER(IF($A$2=\"R\",IF(OR(M29=1,M29=\"a\"),I29,IF(OR(M29=2,M29=\"b\"),I30,\"\")),IF(OR(M29=1,M29=\"a\"),K29,IF(OR(M29=2,M29=\"b\"),K30,\"\"))))","v":"ΣΠΥΡΟΠΟΥΛΟΣ"},null,null,null,null,null,null,null,null,"46 76(7) 60"]
[26,{"$f":"19-D30+8","v":22},{"$f":"B29","v":8},5,{"$f":"IF($B$2>=C30,1,0)","v":0},{"$f":"IF(NOT($G30=\"-\"),VLOOKUP($G30,DrawPrep!$A$3:$F$34,2,FALSE),\"\")","v":0},{"$f":"IF($B$2>=C30,\"-\",VLOOKUP($B30,Setup!$K$2:$L$33,2,FALSE))","v":23},{"$f":"IF(NOT($G30=\"-\"),VLOOKUP($G30,DrawPrep!$A$3:$F$34,6,FALSE),0)","v":0},{"$f":"IF(Setup!$B$24=\"#\",0,IF(NOT($G30=\"-\"),VLOOKUP($G30,DrawPrep!$A$3:$F$34,3,FALSE),0))","v":38017},{"$f":"IF($I30>0,VLOOKUP($I30,DrawPrep!$C$3:$F$34,2,FALSE),\"bye\")","v":"ΝΕΚΤΑΡΙΟΣ ΑΘΑΝΑΣΙΟΣ"},"ΝΕΚΤΑΡΙΟΣ",{"$f":"IF($I30>0,VLOOKUP($I30,DrawPrep!$C$3:$F$34,3,FALSE),\"\")","v":"ΗΡΑΚΛΕΙΟ Ο.Α.& Α."},null,null,"40 40",1,{"$f":"IF((OR(P30=1,P30=2)),IF(P30=1,N29,N31),\"\")","v":35629},{"$f":"UPPER(IF($A$2=\"R\",IF(OR(P30=1,P30=\"a\"),O29,IF(OR(P30=2,P30=\"b\"),O31,\"\")),IF(OR(P30=1,P30=\"a\"),O29,IF(OR(P30=2,P30=\"b\"),O31,\"\"))))","v":"ΣΠΥΡΟΠΟΥΛΟΣ"}]
[27,{"$f":"20-D31+8","v":23},null,5,0,{"$f":"IF(NOT($G31=\"-\"),VLOOKUP($G31,DrawPrep!$A$3:$F$34,2,FALSE),\"\")","v":0},{"$f":"VLOOKUP($B31,Setup!$K$2:$L$33,2,FALSE)","v":16},{"$f":"IF($G31>0,VLOOKUP($G31,DrawPrep!$A$3:$F$34,6,FALSE),0)","v":2},{"$f":"IF(Setup!$B$24=\"#\",0,IF($G31>0,VLOOKUP($G31,DrawPrep!$A$3:$F$34,3,FALSE),0))","v":38697},{"$f":"IF($I31>0,VLOOKUP($I31,DrawPrep!$C$3:$F$34,2,FALSE),\"bye\")","v":"ΤΑΒΕΡΝΑΡΑΚΗΣ ΕΜΜΑΝΟΥΗΛ"},"ΤΑΒΕΡΝΑΡΑΚΗΣ",{"$f":"IF($I31>0,VLOOKUP($I31,DrawPrep!$C$3:$F$34,3,FALSE),\"\")","v":"ΗΡΑΚΛΕΙΟ Ο.Α.& Α."},1,{"$f":"IF((OR(M31=1,M31=2)),IF(M31=1,I31,I32),\"\")","v":38697},{"$f":"UPPER(IF($A$2=\"R\",IF(OR(M31=1,M31=\"a\"),I31,IF(OR(M31=2,M31=\"b\"),I32,\"\")),IF(OR(M31=1,M31=\"a\"),K31,IF(OR(M31=2,M31=\"b\"),K32,\"\"))))","v":"ΤΑΒΕΡΝΑΡΑΚΗΣ"},null,null,"41 40"]
[28,{"$f":"21-D32+8","v":24},10,5,{"$f":"IF($B$2>=C32,1,0)","v":0},{"$f":"IF(NOT($G32=\"-\"),VLOOKUP($G32,DrawPrep!$A$3:$F$34,2,FALSE),\"\")","v":0},{"$f":"IF($B$2>=C32,\"-\",VLOOKUP($B32,Setup!$K$2:$L$33,2,FALSE))","v":14},{"$f":"IF(NOT($G32=\"-\"),VLOOKUP($G32,DrawPrep!$A$3:$F$34,6,FALSE),0)","v":5},{"$f":"IF(Setup!$B$24=\"#\",0,IF(NOT($G32=\"-\"),VLOOKUP($G32,DrawPrep!$A$3:$F$34,3,FALSE),0))","v":33985},{"$f":"IF($I32>0,VLOOKUP($I32,DrawPrep!$C$3:$F$34,2,FALSE),\"bye\")","v":"ΤΣΙΤΟΥΝΗΣ ΜΙΧΑΛΗΣ"},"ΤΣΙΤΟΥΝΗΣ",{"$f":"IF($I32>0,VLOOKUP($I32,DrawPrep!$C$3:$F$34,3,FALSE),\"\")","v":"ΦΙΛΙΑ Τ.Κ."},null,null,"53 42",null,null,null,2,{"$f":"IF((OR(S32=1,S32=2)),IF(S32=1,Q30,Q34),\"\")","v":36263},{"$f":"UPPER(IF($A$2=\"R\",IF(OR(S32=1,S32=\"a\"),R30,IF(OR(S32=2,S32=\"b\"),R34,\"\")),IF(OR(S32=1,S32=\"a\"),R30,IF(OR(S32=2,S32=\"b\"),R34,\"\"))))","v":"ΜΑΝΔΑΛΕΝΑΚΗΣ"}]
[29,{"$f":"22-D33+8","v":25},null,5,0,{"$f":"IF(NOT($G33=\"-\"),VLOOKUP($G33,DrawPrep!$A$3:$F$34,2,FALSE),\"\")","v":0},{"$f":"VLOOKUP($B33,Setup!$K$2:$L$33,2,FALSE)","v":24},{"$f":"IF($G33>0,VLOOKUP($G33,DrawPrep!$A$3:$F$34,6,FALSE),0)","v":0},{"$f":"IF(Setup!$B$24=\"#\",0,IF($G33>0,VLOOKUP($G33,DrawPrep!$A$3:$F$34,3,FALSE),0))","v":36616},{"$f":"IF($I33>0,VLOOKUP($I33,DrawPrep!$C$3:$F$34,2,FALSE),\"bye\")","v":"ΚΟΚΚΑΛΗΣ ΣΤΥΛΙΑΝΟΣ"},"ΚΟΚΚΑΛΗΣ",{"$f":"IF($I33>0,VLOOKUP($I33,DrawPrep!$C$3:$F$34,3,FALSE),\"\")","v":"Γ.Σ.ΛΙΒΥΚΟΣ ΙΕΡΑΠΕΤΡΑΣ"},2,{"$f":"IF((OR(M33=1,M33=2)),IF(M33=1,I33,I34),\"\")","v":37664},{"$f":"UPPER(IF($A$2=\"R\",IF(OR(M33=1,M33=\"a\"),I33,IF(OR(M33=2,M33=\"b\"),I34,\"\")),IF(OR(M33=1,M33=\"a\"),K33,IF(OR(M33=2,M33=\"b\"),K34,\"\"))))","v":"ΚΑΫΜΕΝΑΚΗΣ"},null,null,null,null,null,"40 40"]
[30,{"$f":"23-D34+8","v":26},16,5,{"$f":"IF($B$2>=C34,1,0)","v":0},{"$f":"IF(NOT($G34=\"-\"),VLOOKUP($G34,DrawPrep!$A$3:$F$34,2,FALSE),\"\")","v":0},{"$f":"IF($B$2>=C34,\"-\",VLOOKUP($B34,Setup!$K$2:$L$33,2,FALSE))","v":13},{"$f":"IF(NOT($G34=\"-\"),VLOOKUP($G34,DrawPrep!$A$3:$F$34,6,FALSE),0)","v":7.25},{"$f":"IF(Setup!$B$24=\"#\",0,IF(NOT($G34=\"-\"),VLOOKUP($G34,DrawPrep!$A$3:$F$34,3,FALSE),0))","v":37664},{"$f":"IF($I34>0,VLOOKUP($I34,DrawPrep!$C$3:$F$34,2,FALSE),\"bye\")","v":"ΚΑΫΜΕΝΑΚΗΣ ΑΡΙΣΤΟΤΕΛΗΣ"},"ΚΑΫΜΕΝΑΚΗΣ",{"$f":"IF($I34>0,VLOOKUP($I34,DrawPrep!$C$3:$F$34,3,FALSE),\"\")","v":"Ο.Α.ΧΑΝΙΩΝ"},null,null,"40 42",2,{"$f":"IF((OR(P34=1,P34=2)),IF(P34=1,N33,N35),\"\")","v":36263},{"$f":"UPPER(IF($A$2=\"R\",IF(OR(P34=1,P34=\"a\"),O33,IF(OR(P34=2,P34=\"b\"),O35,\"\")),IF(OR(P34=1,P34=\"a\"),O33,IF(OR(P34=2,P34=\"b\"),O35,\"\"))))","v":"ΜΑΝΔΑΛΕΝΑΚΗΣ"}]
[31,{"$f":"24-D35+8","v":26},{"$f":"B36","v":2},6,{"$f":"IF($B$2>=C35,1,0)","v":1},{"$f":"IF(NOT($G35=\"-\"),VLOOKUP($G35,DrawPrep!$A$3:$F$34,2,FALSE),\"\")","v":""},{"$f":"IF($B$2>=C35,\"-\",VLOOKUP($B35,Setup!$K$2:$L$33,2,FALSE))","v":"-"},{"$f":"IF(NOT($G35=\"-\"),VLOOKUP($G35,DrawPrep!$A$3:$F$34,6,FALSE),0)","v":0},{"$f":"IF(Setup!$B$24=\"#\",0,IF(NOT($G35=\"-\"),VLOOKUP($G35,DrawPrep!$A$3:$F$34,3,FALSE),0))","v":0},{"$f":"IF($I35>0,VLOOKUP($I35,DrawPrep!$C$3:$F$34,2,FALSE),\"bye\")","v":"bye"},"",{"$f":"IF($I35>0,VLOOKUP($I35,DrawPrep!$C$3:$F$34,3,FALSE),\"\")","v":""},2,{"$f":"IF((OR(M35=1,M35=2)),IF(M35=1,I35,I36),\"\")","v":36263},{"$f":"UPPER(IF($A$2=\"R\",IF(OR(M35=1,M35=\"a\"),I35,IF(OR(M35=2,M35=\"b\"),I36,\"\")),IF(OR(M35=1,M35=\"a\"),K35,IF(OR(M35=2,M35=\"b\"),K36,\"\"))))","v":"ΜΑΝΔΑΛΕΝΑΚΗΣ"},null,null,"42 42"]
[32,2,null,6,0,{"$f":"IF(NOT($G36=\"-\"),VLOOKUP($G36,DrawPrep!$A$3:$F$34,2,FALSE),\"\")","v":0},{"$f":"VLOOKUP($B36,Setup!$K$2:$L$33,2,FALSE)","v":2},{"$f":"IF($G36>0,VLOOKUP($G36,DrawPrep!$A$3:$F$34,6,FALSE),0)","v":28},{"$f":"IF(Setup!$B$24=\"#\",0,IF($G36>0,VLOOKUP($G36,DrawPrep!$A$3:$F$34,3,FALSE),0))","v":36263},{"$f":"IF($I36>0,VLOOKUP($I36,DrawPrep!$C$3:$F$34,2,FALSE),\"bye\")","v":"ΜΑΝΔΑΛΕΝΑΚΗΣ ΑΝΑΣΤΑΣΙΟΣ"},"ΜΑΝΔΑΛΕΝΑΚΗΣ",{"$f":"IF($I36>0,VLOOKUP($I36,DrawPrep!$C$3:$F$34,3,FALSE),\"\")","v":"ΗΡΑΚΛΕΙΟ Ο.Α.& Α."}]
[null,null,null,null,null,null,null,null,null,null,null,null,null,null,null,null,null," ",null,null," ",null,null," "]
[null,null,null,null,null,null,null,null,null,"seeded players"]
[null,null,null,null,null,null,null,null,null,{"$f":"\"1. \" & IF(Setup!B19>0,LEFT(DrawPrep!D3,FIND(\" \",DrawPrep!D3)+1),\"\")","v":"1. ΜΑΤΣΑΜΑΚΗΣ Ε"},null,{"$f":"\"5. \" & IF(Setup!B19>4,LEFT(DrawPrep!D7,FIND(\" \",DrawPrep!D7)+1),\"\")","v":"5. ΧΑΛΑΚΑΤΕΒΑΚΗΣ Α"}]
[null,null,null,null,null,null,null,null,null,{"$f":"\"2. \" & IF(Setup!B19>1,LEFT(DrawPrep!D4,FIND(\" \",DrawPrep!D4)+1),\"\")","v":"2. ΜΑΝΔΑΛΕΝΑΚΗΣ Α"},null,{"$f":"\"6. \" & IF(Setup!B19>5,LEFT(DrawPrep!D8,FIND(\" \",DrawPrep!D8)+1),\"\")","v":"6. ΠΕΤΡΑΚΗΣ Σ"},null,null,null,null,null,null,null,null,"επιδιαιτητής"]
[null,null,null,null,null,null,null,null,null,{"$f":"\"3. \" & IF(Setup!B19>2,LEFT(DrawPrep!D5,FIND(\" \",DrawPrep!D5)+1),\"\")","v":"3. ΓΕΝΝΑΡΑΚΗΣ Ν"},null,{"$f":"\"7. \" & IF(Setup!B19>6,LEFT(DrawPrep!D9,FIND(\" \",DrawPrep!D9)+1),\"\")","v":"7. ΚΟΚΚΙΝΑΚΗΣ Γ"},null,null,null,null,null,null,null,null,{"$f":"Setup!B11","v":"Κ. Χατζηδάκης"}]
[null,null,null,null,null,null,null,null,null,{"$f":"\"4. \" & IF(Setup!B19>3,LEFT(DrawPrep!D6,FIND(\" \",DrawPrep!D6)+1),\"\")","v":"4. ΖΕΡΒΟΣ Σ"},null,{"$f":"\"8. \" & IF(Setup!B19>7,LEFT(DrawPrep!D10,FIND(\" \",DrawPrep!D10)+1),\"\")","v":"8. ΣΠΥΡΟΠΟΥΛΟΣ Ν"}]
[]
[]
[]
[]
[]
[]
[]
[]
[]
[]
[]
[]
[]
[]
[]
[null,null,null,null,null,null,null,null,null,"BoldPlayers"]
[null,null,null,null,null,null,null,null,null,{"$f":"IF(Setup!$B$19>0,LEFT(DrawPrep!D3,FIND(\" \",DrawPrep!D3)-1))","v":"ΜΑΤΣΑΜΑΚΗΣ"}]
[null,null,null,null,null,null,null,null,null,{"$f":"IF(Setup!$B$19>1,LEFT(DrawPrep!D4,FIND(\" \",DrawPrep!D4)-1))","v":"ΜΑΝΔΑΛΕΝΑΚΗΣ"}]
[null,null,null,null,null,null,null,null,null,{"$f":"IF(Setup!$B$19>2,LEFT(DrawPrep!D5,FIND(\" \",DrawPrep!D5)-1))","v":"ΓΕΝΝΑΡΑΚΗΣ"}]
[null,null,null,null,null,null,null,null,null,{"$f":"IF(Setup!$B$19>3,LEFT(DrawPrep!D6,FIND(\" \",DrawPrep!D6)-1))","v":"ΖΕΡΒΟΣ"}]
[null,null,null,null,null,null,null,null,null,{"$f":"IF(Setup!$B$19>4,LEFT(DrawPrep!D7,FIND(\" \",DrawPrep!D7)-1))","v":"ΧΑΛΑΚΑΤΕΒΑΚΗΣ"}]
[null,null,null,null,null,null,null,null,null,{"$f":"IF(Setup!$B$19>5,LEFT(DrawPrep!D8,FIND(\" \",DrawPrep!D8)-1))","v":"ΠΕΤΡΑΚΗΣ"}]
[null,null,null,null,null,null,null,null,null,{"$f":"IF(Setup!$B$19>6,LEFT(DrawPrep!D9,FIND(\" \",DrawPrep!D9)-1))","v":"ΚΟΚΚΙΝΑΚΗΣ"}]
[null,null,null,null,null,null,null,null,null,{"$f":"IF(Setup!$B$19>7,LEFT(DrawPrep!D10,FIND(\" \",DrawPrep!D10)-1))","v":"ΣΠΥΡΟΠΟΥΛΟΣ"}]

{"sheet":"Day1","index":3,"n_rows":80,"n_cols":6,"rows_kept":80,"cut":false,"hidden":false,"merged":[[2,5,3,5]]}
["Ζ΄ ΕΝΩΣΗ, 3ο Ε3 2016, Γ.Σ. ΛΙΒΥΚΟΣ ΙΕΡΑΠ. (Α12)"]
["Κ. Χατζηδάκης"]
["Πρόγραμμα αγώνων",null,null,null,"Round 1","i"]
["ΩΡΑ","Κτγρ.","Αθλητής-Σύλλογος",null,"Αθλητής-Σύλλογος"]
["Έναρξη","Α12","ΜΑΤΣΑΜΑΚΗΣ Ε (Ο.Α.ΧΑΝΙΩΝ)"," ",""]
[null,"Α12","ΚΩΣΤΑΚΗΣ Ε (ΗΡΑΚΛΕΙΟ Ο.Α.& Α.)","-","ΒΟΛΤΥΡΑΚΗΣ Ε (Ο.Α.ΧΑΝΙΩΝ)"]
[null,"Α12","ΠΕΡΔΙΚΑΚΗΣ Ε (Γ.Σ.ΛΙΒΥΚΟΣ ΙΕΡΑΠΕΤΡΑΣ)","-","ΦΟΥΝΤΟΥΛΑΚΗΣ Ν (Ο.Α.ΧΑΝΙΩΝ)"]
[null,"Α12",""," ","ΠΕΤΡΑΚΗΣ Σ (Ο.Α.ΧΑΝΙΩΝ)"]
[null,"Α12","ΓΕΝΝΑΡΑΚΗΣ Ν (ΗΡΑΚΛΕΙΟ Ο.Α.& Α.)"," ",""]
["όχι πριν","Α12","ΜΠΟΥΝΑΚΗΣ Δ (ΗΡΑΚΛΕΙΟ Ο.Α.& Α.)","-","ΚΑΛΑΤΖΗΣ Α (ΗΡΑΚΛΕΙΟ Ο.Α.& Α.)"]
[null,"Α12","ΚΑΡΑΚΩΣΤΑΣ Σ (ΗΡΑΚΛΕΙΟ Ο.Α.& Α.)","-","ΒΕΛΕΝΤΑΚΗΣ Ι (ΗΡΑΚΛΕΙΟ Ο.Α.& Α.)"]
[null,"Α12","ΝΙΝΟΣ Ν (Ο.Α.ΡΕΘΥΜΝΟΥ)","-","ΚΟΚΚΙΝΑΚΗΣ Γ (Ο.Α.ΧΑΝΙΩΝ)"]
[null,"Α12","ΧΑΛΑΚΑΤΕΒΑΚΗΣ Α (Ο.Α.ΧΑΝΙΩΝ)"," ",""]
[null,"Α12","ΣΤΡΟΜΠΑ Ι (Ο.Α.ΧΑΝΙΩΝ)","-","ΒΕΓΟΠΟΥΛΟΣ Χ (ΦΙΛΙΑ Τ.Κ.)"]
["όχι πριν","Α12","ΜΑΡΑΚΗΣ Μ (Ο.Α.ΧΑΝΙΩΝ)","-","ΞΙΑΡΧΟΣ Ε (Α.Ο.ΛΑΤΩ ΑΓ.ΝΙΚΟΛΑΟΥ)"]
[null,"Α12",""," ","ΖΕΡΒΟΣ Σ (Ο.Α.ΧΑΝΙΩΝ)"]
[null,"Α12","ΣΠΥΡΟΠΟΥΛΟΣ Ν (Ο.Α.ΡΕΘΥΜΝΟΥ)","-","ΝΕΚΤΑΡΙΟΣ Α (ΗΡΑΚΛΕΙΟ Ο.Α.& Α.)"]
[null,"Α12","ΤΑΒΕΡΝΑΡΑΚΗΣ Ε (ΗΡΑΚΛΕΙΟ Ο.Α.& Α.)","-","ΤΣΙΤΟΥΝΗΣ Μ (ΦΙΛΙΑ Τ.Κ.)"]
[null,"Α12","ΚΟΚΚΑΛΗΣ Σ (Γ.Σ.ΛΙΒΥΚΟΣ ΙΕΡΑΠΕΤΡΑΣ)","-","ΚΑΫΜΕΝΑΚΗΣ Α (Ο.Α.ΧΑΝΙΩΝ)"]
[null,"Α12",""," ","ΜΑΝΔΑΛΕΝΑΚΗΣ Α (ΗΡΑΚΛΕΙΟ Ο.Α.& Α.)"]
[]
["Έναρξη","Κ12","ΜΑΡΙΝΑΚΗ Σ (Ο.Α.ΧΑΝΙΩΝ)"," ",""]
[null,"Κ12","ΓΑΡΕΦΑΛΑΚΗ Μ (ΗΡΑΚΛΕΙΟ Ο.Α.& Α.)","-","ΚΑΡΟΦΥΛΑΚΗ Β (Γ.Σ.ΛΙΒΥΚΟΣ ΙΕΡΑΠΕΤΡΑΣ)"]
[null,"Κ12","ΠΡΙΝΙΑΝΑΚΗ Ε (ΦΙΛΙΑ Τ.Κ.)"," ",""]
[null,"Κ12",""," ","ΔΑΒΡΑΔΟΥ Ε (Α.Ο.ΛΑΤΩ ΑΓ.ΝΙΚΟΛΑΟΥ)"]
["όχι πριν","Κ12","ΝΤΑΜΠΑΚΑΚΗ Χ (ΗΡΑΚΛΕΙΟ Ο.Α.& Α.)"," ",""]
[null,"Κ12","ΚΟΚΚΙΝΑΚΗ Μ (Ο.Α.ΧΑΝΙΩΝ)"," ",""]
[null,"Κ12","ΚΑΡΑΠΑΝΤΑΖΗ Κ (Ο.Α.ΣΟΥΔΑΣ)","-","ΧΑΤΖΗΑΘΑΝΑΣΙΑΔΗ Ι (ΗΡΑΚΛΕΙΟ Ο.Α.& Α.)"]
[null,"Κ12",""," ","ΑΛΠΑΝΤΗ Α (Ο.Α.ΣΟΥΔΑΣ)"]
[]
[null,"Α16","ΤΣΑΚΑΛΑΚΗΣ Ν (ΗΡΑΚΛΕΙΟ Ο.Α.& Α.)","-","ΣΙΜΑΤΟΣ Γ (ΗΡΑΚΛΕΙΟ Ο.Α.& Α.)"]
[]
["13:30:00","Κ16","ΜΠΑΛΑΣΚΑ Β (Ο.Α.ΧΑΝΙΩΝ)","-","ΔΕΣΚΟΥΛΙΔΟΥ Ι (Α.Π.Μ.Σ.ΑΣΚΗΣΗ ΗΡΑΚΛΕΙΟΥ)"]
[null,"Κ16","ΖΑΦΕΙΡΟΠΟΥΛΟΥ Κ (ΗΡΑΚΛΕΙΟ Ο.Α.& Α.)","-","ΔΕΣΚΟΥΛΙΔΟΥ Χ (Α.Π.Μ.Σ.ΑΣΚΗΣΗ ΗΡΑΚΛΕΙΟΥ)"]
[null,"Κ16","ΒΑΡΒΕΡΑΚΗ Μ (Ο.Α.ΧΑΝΙΩΝ)","-","ΚΡΟΝΤΗΡΑ Ε (ΗΡΑΚΛΕΙΟ Ο.Α.& Α.)"]
[null,"Κ16","ΣΤΑΜΟΥΛΟΥ Α (Ο.Α.ΧΑΝΙΩΝ)","-","ΒΕΛΙΒΑΣΑΚΗ Χ (ΗΡΑΚΛΕΙΟ Ο.Α.& Α.)"]
[]
["14:30:00","Α12","ΜΑΤΣΑΜΑΚΗΣ Ε (Ο.Α.ΧΑΝΙΩΝ)",null,"ΒΟΛΤΥΡΑΚΗΣ Ε (Ο.Α.ΧΑΝΙΩΝ)"]
[null,"Α12","ΠΕΡΔΙΚΑΚΗΣ Ε (Γ.Σ.ΛΙΒΥΚΟΣ ΙΕΡΑΠΕΤΡΑΣ)",null,"ΠΕΤΡΑΚΗΣ Σ (Ο.Α.ΧΑΝΙΩΝ)"]
[null,"Α12","ΓΕΝΝΑΡΑΚΗΣ Ν (ΗΡΑΚΛΕΙΟ Ο.Α.& Α.)",null,"ΜΠΟΥΝΑΚΗΣ Δ (ΗΡΑΚΛΕΙΟ Ο.Α.& Α.)"]
[null,"Α12","ΚΑΡΑΚΩΣΤΑΣ Σ (ΗΡΑΚΛΕΙΟ Ο.Α.& Α.)",null,"ΚΟΚΚΙΝΑΚΗΣ Γ (Ο.Α.ΧΑΝΙΩΝ)"]
["15:30:00","Α12","ΧΑΛΑΚΑΤΕΒΑΚΗΣ Α (Ο.Α.ΧΑΝΙΩΝ)",null,"ΣΤΡΟΜΠΑ Ι (Ο.Α.ΧΑΝΙΩΝ)"]
[null,"Α12","ΜΑΡΑΚΗΣ Μ (Ο.Α.ΧΑΝΙΩΝ)",null,"ΖΕΡΒΟΣ Σ (Ο.Α.ΧΑΝΙΩΝ)"]
[null,"Α12","ΣΠΥΡΟΠΟΥΛΟΣ Ν (Ο.Α.ΡΕΘΥΜΝΟΥ)",null,"ΤΑΒΕΡΝΑΡΑΚΗΣ Ε (ΗΡΑΚΛΕΙΟ Ο.Α.& Α.)"]
[null,"Α12","ΚΑΫΜΕΝΑΚΗΣ Α (Ο.Α.ΧΑΝΙΩΝ)",null,"ΜΑΝΔΑΛΕΝΑΚΗΣ Α (ΗΡΑΚΛΕΙΟ Ο.Α.& Α.)"]
[]
["16:00:00","Κ12","ΜΑΡΙΝΑΚΗ",null,"ΓΑΡΕΦΑΛΑΚΗ"]
[null,"Κ12","ΠΡΙΝΙΑΝΑΚΗ",null,"ΔΑΒΡΑΔΟΥ"]
[null,"Κ12","ΝΤΑΜΠΑΚΑΚΗ",null,"ΚΟΚΚΙΝΑΚΗ"]
[null,"Κ12","ΚΑΡΑΠΑΝΤΑΖΗ",null,"ΑΛΠΑΝΤΗ"]
[]
["17:00:00","Α16","ΚΑΡΑΧΑΛΙΟΣ",null,"ΜΑΡΓΑΡΙΤΗΣ"]
[null,"Α16","ΚΟΝΤΑΡΑΚΗΣ",null,"ΧΑΛΑΚΑΤΕΒΑΚΗΣ"]
[null,"Α16","ΚΩΝΣΤΑΝΤΑΡΑΚΗΣ ΑΝΔΡΕΑΣ",null,"ΚΩΝΣΤΑΝΤΑΡΑΚΗΣ ΑΝΤΩΝΙΟΣ"]
[null,"Α16","ΤΣΑΚΑΛΑΚΗΣ",null,"ΜΑΤΣΑΜΑΚΗΣ"]
[]
["18:00:00","Κ16","ΜΠΑΛΑΣΚΑ Β (Ο.Α.ΧΑΝΙΩΝ)",null,"ΖΑΦΕΙΡΟΠΟΥΛΟΥ Κ (ΗΡΑΚΛΕΙΟ Ο.Α.& Α.)"]
[null,"Κ16","ΒΑΡΒΕΡΑΚΗ Μ (Ο.Α.ΧΑΝΙΩΝ)",null,"ΒΕΛΙΒΑΣΑΚΗ Χ (ΗΡΑΚΛΕΙΟ Ο.Α.& Α.)"]
[]
["19:00:00","Α12","ΜΑΤΣΑΜΑΚΗΣ Ε (Ο.Α.ΧΑΝΙΩΝ)",null,"ΠΕΤΡΑΚΗΣ Σ (Ο.Α.ΧΑΝΙΩΝ)"]
[null,"Α12","ΓΕΝΝΑΡΑΚΗΣ Ν (ΗΡΑΚΛΕΙΟ Ο.Α.& Α.)",null,"ΚΟΚΚΙΝΑΚΗΣ Γ (Ο.Α.ΧΑΝΙΩΝ)"]
[null,"Α12","ΣΤΡΟΜΠΑ Ι (Ο.Α.ΧΑΝΙΩΝ)",null,"ΖΕΡΒΟΣ Σ (Ο.Α.ΧΑΝΙΩΝ)"]
[null,"Α12","ΣΠΥΡΟΠΟΥΛΟΣ Ν (Ο.Α.ΡΕΘΥΜΝΟΥ)",null,"ΜΑΝΔΑΛΕΝΑΚΗΣ Α (ΗΡΑΚΛΕΙΟ Ο.Α.& Α.)"]
[]
[]
[null,null,"ΚΥΡΙΑΚΗ 23/10/2016"]
[]
["09:00:00","ημΑ12"]
[null,"ημΑ12"]
[null,"ημΚ12"]
[null,"ημΚ12"]
[]
["10:00:00","ημΑ16"]
[null,"ημΑ16"]
[null,"τελΚ16"]
[]
["12:00:00","τελΑ12"]
[null,"τελΚ12"]
[]
["13:00:00","τελΑ16"]

{"sheet":"Day2","index":4,"n_rows":20,"n_cols":6,"rows_kept":20,"cut":false,"hidden":false,"merged":[[2,5,3,5]]}
["Ζ΄ ΕΝΩΣΗ, 3ο Ε3 2016, Γ.Σ. ΛΙΒΥΚΟΣ ΙΕΡΑΠ. (Α12)"]
["Κ. Χατζηδάκης"]
["Πρόγραμμα αγώνων",null,null,null,"Round 1","i"]
["ΩΡΑ","Κτγρ.","Αθλητής-Σύλλογος",null,"Αθλητής-Σύλλογος"]
["Έναρξη","Α12","ΟΡΦΑΝΙΔΗΣ Μ (0)","-","ΚΟΥΛΟΥΜΠΗΣ Γ (0)"]
[null,"Α12","ΦΩΚΙΑΛΗΣ Γ (0)","-","ΔΕΣΥΠΡΗΣ Γ (0)"]
[null,"Α12","ΡΟΔΙΤΗΣ Ν (0)","-","ΠΑΠΟΥΤΣΗΣ Π (0)"]
[null,"Α12","ΠΕΡΡΗΣ Ν (0)","-","ΓΕΩΡΓΙΑΔΗΣ Α (0)"]
[null,"Α12","ΜΑΜΑΣΗΣ Γ (0)","-","ΜΩΥΣΙΔΗΣ Ν (0)"]
["όχι πριν","Α12","ΦΡΑΓΚΑΚΗΣ Τ (0)","-","ΠΕΝΣΟΣ Ε (0)"]
[null,"Α12","ΤΖΩΡΤΖΗΣ Δ (0)","-","ΠΑΝΤΑΖΑΤΟΣ Γ (0)"]
[null,"Α12","ΖΑΦΕΙΡΟΠΟΥΛΟΣ Α (0)","-","GENTILI S (0)"]
[]
[]
[]
[]
[]
[]
[]
[" "]

{"sheet":"notes","index":5,"n_rows":0,"n_cols":0,"rows_kept":0,"cut":false,"hidden":false,"merged":[]}

{"sheet":"PrgPrep","index":6,"n_rows":37,"n_cols":8,"rows_kept":37,"cut":false,"hidden":false,"merged":[[2,5,3,5],[21,5,22,5]]}
[{"$f":"Setup!B3 & \", \" & Setup!B4 & \", \" & Setup!B7  & \" (\" & Setup!B8 & \")\"","v":"Ζ΄ ΕΝΩΣΗ, 3ο Ε3 2016, Γ.Σ. ΛΙΒΥΚΟΣ ΙΕΡΑΠ. (Α12)"},null,null,null,null,null,null,"Don't Change this Worksheet !"]
[{"$f":"Setup!$B$11","v":"Κ. Χατζηδάκης"}]
["Πρόγραμμα αγώνων",null,null,null,"Round 1","i"]
["ΩΡΑ","Κτγρ.","Αθλητής-Σύλλογος",null,"Αθλητής-Σύλλογος"]
["Έναρξη",{"$f":"Setup!$B$8","v":"Α12"},{"$f":"IF(OR(MD!J5=\"bye\",MD!J5=\"LWD\"),\"\",CONCATENATE(LEFT(MD!J5,FIND(\" \",MD!J5)+1),\" (\",MD!L5,\")\"))","v":"ΜΑΤΣΑΜΑΚΗΣ Ε (Ο.Α.ΧΑΝΙΩΝ)"},{"$f":"IF(OR(C5=\"\",E5=\"\"),\" \",\"-\")","v":" "},{"$f":"IF(OR(MD!J6=\"bye\",MD!J6=\"LWD\"), \"\", CONCATENATE(LEFT(MD!J6,FIND(\" \",MD!J6)+1),\" (\",MD!L6,\")\"))","v":""}]
[null,{"$f":"Setup!$B$8","v":"Α12"},{"$f":"IF(OR(MD!J7=\"bye\",MD!J7=\"LWD\"),\"\",CONCATENATE(LEFT(MD!J7,FIND(\" \",MD!J7)+1),\" (\",MD!L7,\")\"))","v":"ΚΩΣΤΑΚΗΣ Ε (ΗΡΑΚΛΕΙΟ Ο.Α.& Α.)"},{"$f":"IF(OR(C6=\"\",E6=\"\"),\" \",\"-\")","v":"-"},{"$f":"IF(OR(MD!J8=\"bye\",MD!J8=\"LWD\"), \"\", CONCATENATE(LEFT(MD!J8,FIND(\" \",MD!J8)+1),\" (\",MD!L8,\")\"))","v":"ΒΟΛΤΥΡΑΚΗΣ Ε (Ο.Α.ΧΑΝΙΩΝ)"}]
[null,{"$f":"Setup!$B$8","v":"Α12"},{"$f":"IF(OR(MD!J9=\"bye\",MD!J9=\"LWD\"),\"\",CONCATENATE(LEFT(MD!J9,FIND(\" \",MD!J9)+1),\" (\",MD!L9,\")\"))","v":"ΠΕΡΔΙΚΑΚΗΣ Ε (Γ.Σ.ΛΙΒΥΚΟΣ ΙΕΡΑΠΕΤΡΑΣ)"},"-",{"$f":"IF(OR(MD!J10=\"bye\",MD!J10=\"LWD\"), \"\", CONCATENATE(LEFT(MD!J10,FIND(\" \",MD!J10)+1),\" (\",MD!L10,\")\"))","v":"ΦΟΥΝΤΟΥΛΑΚΗΣ Ν (Ο.Α.ΧΑΝΙΩΝ)"}]
[null,{"$f":"Setup!$B$8","v":"Α12"},{"$f":"IF(OR(MD!J11=\"bye\",MD!J11=\"LWD\"),\"\",CONCATENATE(LEFT(MD!J11,FIND(\" \",MD!J11)+1),\" (\",MD!L11,\")\"))","v":""}," ",{"$f":"IF(OR(MD!J12=\"bye\",MD!J12=\"LWD\"), \"\", CONCATENATE(LEFT(MD!J12,FIND(\" \",MD!J12)+1),\" (\",MD!L12,\")\"))","v":"ΠΕΤΡΑΚΗΣ Σ (Ο.Α.ΧΑΝΙΩΝ)"}]
["όχι πριν",{"$f":"Setup!$B$8","v":"Α12"},{"$f":"IF(OR(MD!J13=\"bye\",MD!J13=\"LWD\"),\"\",CONCATENATE(LEFT(MD!J13,FIND(\" \",MD!J13)+1),\" (\",MD!L13,\")\"))","v":"ΓΕΝΝΑΡΑΚΗΣ Ν (ΗΡΑΚΛΕΙΟ Ο.Α.& Α.)"}," ",{"$f":"IF(OR(MD!J14=\"bye\",MD!J14=\"LWD\"), \"\", CONCATENATE(LEFT(MD!J14,FIND(\" \",MD!J14)+1),\" (\",MD!L14,\")\"))","v":""}]
[null,{"$f":"Setup!$B$8","v":"Α12"},{"$f":"IF(OR(MD!J15=\"bye\",MD!J15=\"LWD\"),\"\",CONCATENATE(LEFT(MD!J15,FIND(\" \",MD!J15)+1),\" (\",MD!L15,\")\"))","v":"ΜΠΟΥΝΑΚΗΣ Δ (ΗΡΑΚΛΕΙΟ Ο.Α.& Α.)"},"-",{"$f":"IF(OR(MD!J16=\"bye\",MD!J16=\"LWD\"), \"\", CONCATENATE(LEFT(MD!J16,FIND(\" \",MD!J16)+1),\" (\",MD!L16,\")\"))","v":"ΚΑΛΑΤΖΗΣ Α (ΗΡΑΚΛΕΙΟ Ο.Α.& Α.)"}]
[null,{"$f":"Setup!$B$8","v":"Α12"},{"$f":"IF(OR(MD!J17=\"bye\",MD!J17=\"LWD\"),\"\",CONCATENATE(LEFT(MD!J17,FIND(\" \",MD!J17)+1),\" (\",MD!L17,\")\"))","v":"ΚΑΡΑΚΩΣΤΑΣ Σ (ΗΡΑΚΛΕΙΟ Ο.Α.& Α.)"},"-",{"$f":"IF(OR(MD!J18=\"bye\",MD!J18=\"LWD\"), \"\", CONCATENATE(LEFT(MD!J18,FIND(\" \",MD!J18)+1),\" (\",MD!L18,\")\"))","v":"ΒΕΛΕΝΤΑΚΗΣ Ι (ΗΡΑΚΛΕΙΟ Ο.Α.& Α.)"}]
[null,{"$f":"Setup!$B$8","v":"Α12"},{"$f":"IF(OR(MD!J19=\"bye\",MD!J19=\"LWD\"),\"\",CONCATENATE(LEFT(MD!J19,FIND(\" \",MD!J19)+1),\" (\",MD!L19,\")\"))","v":"ΝΙΝΟΣ Ν (Ο.Α.ΡΕΘΥΜΝΟΥ)"},"-",{"$f":"IF(OR(MD!J20=\"bye\",MD!J20=\"LWD\"), \"\", CONCATENATE(LEFT(MD!J20,FIND(\" \",MD!J20)+1),\" (\",MD!L20,\")\"))","v":"ΚΟΚΚΙΝΑΚΗΣ Γ (Ο.Α.ΧΑΝΙΩΝ)"}]
["όχι πριν",{"$f":"Setup!$B$8","v":"Α12"},{"$f":"IF(OR(MD!J21=\"bye\",MD!J21=\"LWD\"),\"\",CONCATENATE(LEFT(MD!J21,FIND(\" \",MD!J21)+1),\" (\",MD!L21,\")\"))","v":"ΧΑΛΑΚΑΤΕΒΑΚΗΣ Α (Ο.Α.ΧΑΝΙΩΝ)"}," ",{"$f":"IF(OR(MD!J22=\"bye\",MD!J22=\"LWD\"), \"\", CONCATENATE(LEFT(MD!J22,FIND(\" \",MD!J22)+1),\" (\",MD!L22,\")\"))","v":""}]
[null,{"$f":"Setup!$B$8","v":"Α12"},{"$f":"IF(OR(MD!J23=\"bye\",MD!J23=\"LWD\"),\"\",CONCATENATE(LEFT(MD!J23,FIND(\" \",MD!J23)+1),\" (\",MD!L23,\")\"))","v":"ΣΤΡΟΜΠΑ Ι (Ο.Α.ΧΑΝΙΩΝ)"},"-",{"$f":"IF(OR(MD!J24=\"bye\",MD!J24=\"LWD\"), \"\", CONCATENATE(LEFT(MD!J24,FIND(\" \",MD!J24)+1),\" (\",MD!L24,\")\"))","v":"ΒΕΓΟΠΟΥΛΟΣ Χ (ΦΙΛΙΑ Τ.Κ.)"}]
[null,{"$f":"Setup!$B$8","v":"Α12"},{"$f":"IF(OR(MD!J25=\"bye\",MD!J25=\"LWD\"),\"\",CONCATENATE(LEFT(MD!J25,FIND(\" \",MD!J25)+1),\" (\",MD!L25,\")\"))","v":"ΜΑΡΑΚΗΣ Μ (Ο.Α.ΧΑΝΙΩΝ)"},"-",{"$f":"IF(OR(MD!J26=\"bye\",MD!J26=\"LWD\"), \"\", CONCATENATE(LEFT(MD!J26,FIND(\" \",MD!J26)+1),\" (\",MD!L26,\")\"))","v":"ΞΙΑΡΧΟΣ Ε (Α.Ο.ΛΑΤΩ ΑΓ.ΝΙΚΟΛΑΟΥ)"}]
[null,{"$f":"Setup!$B$8","v":"Α12"},{"$f":"IF(OR(MD!J27=\"bye\",MD!J27=\"LWD\"),\"\",CONCATENATE(LEFT(MD!J27,FIND(\" \",MD!J27)+1),\" (\",MD!L27,\")\"))","v":""}," ",{"$f":"IF(OR(MD!J28=\"bye\",MD!J28=\"LWD\"), \"\", CONCATENATE(LEFT(MD!J28,FIND(\" \",MD!J28)+1),\" (\",MD!L28,\")\"))","v":"ΖΕΡΒΟΣ Σ (Ο.Α.ΧΑΝΙΩΝ)"}]
["όχι πριν",{"$f":"Setup!$B$8","v":"Α12"},{"$f":"IF(OR(MD!J29=\"bye\",MD!J29=\"LWD\"),\"\",CONCATENATE(LEFT(MD!J29,FIND(\" \",MD!J29)+1),\" (\",MD!L29,\")\"))","v":"ΣΠΥΡΟΠΟΥΛΟΣ Ν (Ο.Α.ΡΕΘΥΜΝΟΥ)"},"-",{"$f":"IF(OR(MD!J30=\"bye\",MD!J30=\"LWD\"), \"\", CONCATENATE(LEFT(MD!J30,FIND(\" \",MD!J30)+1),\" (\",MD!L30,\")\"))","v":"ΝΕΚΤΑΡΙΟΣ Α (ΗΡΑΚΛΕΙΟ Ο.Α.& Α.)"}]
[null,{"$f":"Setup!$B$8","v":"Α12"},{"$f":"IF(OR(MD!J31=\"bye\",MD!J31=\"LWD\"),\"\",CONCATENATE(LEFT(MD!J31,FIND(\" \",MD!J31)+1),\" (\",MD!L31,\")\"))","v":"ΤΑΒΕΡΝΑΡΑΚΗΣ Ε (ΗΡΑΚΛΕΙΟ Ο.Α.& Α.)"},"-",{"$f":"IF(OR(MD!J32=\"bye\",MD!J32=\"LWD\"), \"\", CONCATENATE(LEFT(MD!J32,FIND(\" \",MD!J32)+1),\" (\",MD!L32,\")\"))","v":"ΤΣΙΤΟΥΝΗΣ Μ (ΦΙΛΙΑ Τ.Κ.)"}]
[null,{"$f":"Setup!$B$8","v":"Α12"},{"$f":"IF(OR(MD!J33=\"bye\",MD!J33=\"LWD\"),\"\",CONCATENATE(LEFT(MD!J33,FIND(\" \",MD!J33)+1),\" (\",MD!L33,\")\"))","v":"ΚΟΚΚΑΛΗΣ Σ (Γ.Σ.ΛΙΒΥΚΟΣ ΙΕΡΑΠΕΤΡΑΣ)"},"-",{"$f":"IF(OR(MD!J34=\"bye\",MD!J34=\"LWD\"), \"\", CONCATENATE(LEFT(MD!J34,FIND(\" \",MD!J34)+1),\" (\",MD!L34,\")\"))","v":"ΚΑΫΜΕΝΑΚΗΣ Α (Ο.Α.ΧΑΝΙΩΝ)"}]
[null,{"$f":"Setup!$B$8","v":"Α12"},{"$f":"IF(OR(MD!J35=\"bye\",MD!J35=\"LWD\"),\"\",CONCATENATE(LEFT(MD!J35,FIND(\" \",MD!J35)+1),\" (\",MD!L35,\")\"))","v":""}," ",{"$f":"IF(OR(MD!J36=\"bye\",MD!J36=\"LWD\"), \"\", CONCATENATE(LEFT(MD!J36,FIND(\" \",MD!J36)+1),\" (\",MD!L36,\")\"))","v":"ΜΑΝΔΑΛΕΝΑΚΗΣ Α (ΗΡΑΚΛΕΙΟ Ο.Α.& Α.)"}]
[]
["Πρόγραμμα αγώνων",null,null,null,"Round 2","i"]
["ΩΡΑ","Κτγρ.","Αθλητής-Σύλλογος",null,"Αθλητής-Σύλλογος"]
["Έναρξη",{"$f":"Setup!$B$8","v":"Α12"},{"$f":"IF(MD!M5=\"\", \"\", IF(MD!M5=1, CONCATENATE(LEFT(MD!J5,FIND(\" \",MD!J5)+1),\" (\",MD!L5,\")\"),CONCATENATE(LEFT(MD!J6,FIND(\" \",MD!J6)+1),\" (\",MD!L6,\")\")))","v":"ΜΑΤΣΑΜΑΚΗΣ Ε (Ο.Α.ΧΑΝΙΩΝ)"},{"$f":"IF(OR(C24=\"\",E24=\"\"),\" \",\"-\")","v":"-"},{"$f":"IF(MD!M7=\"\", \"\", IF(MD!M7=1, CONCATENATE(LEFT(MD!J7,FIND(\" \",MD!J7)+1),\" (\",MD!L7,\")\"),CONCATENATE(LEFT(MD!J8,FIND(\" \",MD!J8)+1),\" (\",MD!L8,\")\")))","v":"ΒΟΛΤΥΡΑΚΗΣ Ε (Ο.Α.ΧΑΝΙΩΝ)"}]
[null,{"$f":"Setup!$B$8","v":"Α12"},{"$f":"IF(MD!M9=\"\", \"\", IF(MD!M9=1, CONCATENATE(LEFT(MD!J9,FIND(\" \",MD!J9)+1),\" (\",MD!L9,\")\"),CONCATENATE(LEFT(MD!J10,FIND(\" \",MD!J10)+1),\" (\",MD!L10,\")\")))","v":"ΠΕΡΔΙΚΑΚΗΣ Ε (Γ.Σ.ΛΙΒΥΚΟΣ ΙΕΡΑΠΕΤΡΑΣ)"},"-",{"$f":"IF(MD!M11=\"\", \"\", IF(MD!M11=1, CONCATENATE(LEFT(MD!J11,FIND(\" \",MD!J11)+1),\" (\",MD!L11,\")\"),CONCATENATE(LEFT(MD!J12,FIND(\" \",MD!J12)+1),\" (\",MD!L12,\")\")))","v":"ΠΕΤΡΑΚΗΣ Σ (Ο.Α.ΧΑΝΙΩΝ)"}]
[null,{"$f":"Setup!$B$8","v":"Α12"},{"$f":"IF(MD!M13=\"\", \"\", IF(MD!M13=1, CONCATENATE(LEFT(MD!J13,FIND(\" \",MD!J13)+1),\" (\",MD!L13,\")\"),CONCATENATE(LEFT(MD!J14,FIND(\" \",MD!J14)+1),\" (\",MD!L14,\")\")))","v":"ΓΕΝΝΑΡΑΚΗΣ Ν (ΗΡΑΚΛΕΙΟ Ο.Α.& Α.)"},"-",{"$f":"IF(MD!M15=\"\", \"\", IF(MD!M15=1, CONCATENATE(LEFT(MD!J15,FIND(\" \",MD!J15)+1),\" (\",MD!L15,\")\"),CONCATENATE(LEFT(MD!J16,FIND(\" \",MD!J16)+1),\" (\",MD!L16,\")\")))","v":"ΜΠΟΥΝΑΚΗΣ Δ (ΗΡΑΚΛΕΙΟ Ο.Α.& Α.)"}]
[null,{"$f":"Setup!$B$8","v":"Α12"},{"$f":"IF(MD!M17=\"\", \"\", IF(MD!M17=1, CONCATENATE(LEFT(MD!J17,FIND(\" \",MD!J17)+1),\" (\",MD!L17,\")\"),CONCATENATE(LEFT(MD!J18,FIND(\" \",MD!J18)+1),\" (\",MD!L18,\")\")))","v":"ΚΑΡΑΚΩΣΤΑΣ Σ (ΗΡΑΚΛΕΙΟ Ο.Α.& Α.)"},"-",{"$f":"IF(MD!M19=\"\", \"\", IF(MD!M19=1, CONCATENATE(LEFT(MD!J19,FIND(\" \",MD!J19)+1),\" (\",MD!L19,\")\"),CONCATENATE(LEFT(MD!J20,FIND(\" \",MD!J20)+1),\" (\",MD!L20,\")\")))","v":"ΚΟΚΚΙΝΑΚΗΣ Γ (Ο.Α.ΧΑΝΙΩΝ)"}]
["όχι πριν",{"$f":"Setup!$B$8","v":"Α12"},{"$f":"IF(MD!M21=\"\", \"\", IF(MD!M21=1, CONCATENATE(LEFT(MD!J21,FIND(\" \",MD!J21)+1),\" (\",MD!L21,\")\"),CONCATENATE(LEFT(MD!J22,FIND(\" \",MD!J22)+1),\" (\",MD!L22,\")\")))","v":"ΧΑΛΑΚΑΤΕΒΑΚΗΣ Α (Ο.Α.ΧΑΝΙΩΝ)"},"-",{"$f":"IF(MD!M23=\"\", \"\", IF(MD!M23=1, CONCATENATE(LEFT(MD!J23,FIND(\" \",MD!J23)+1),\" (\",MD!L23,\")\"),CONCATENATE(LEFT(MD!J24,FIND(\" \",MD!J24)+1),\" (\",MD!L24,\")\")))","v":"ΣΤΡΟΜΠΑ Ι (Ο.Α.ΧΑΝΙΩΝ)"}]
[null,{"$f":"Setup!$B$8","v":"Α12"},{"$f":"IF(MD!M25=\"\", \"\", IF(MD!M25=1, CONCATENATE(LEFT(MD!J25,FIND(\" \",MD!J25)+1),\" (\",MD!L25,\")\"),CONCATENATE(LEFT(MD!J26,FIND(\" \",MD!J26)+1),\" (\",MD!L26,\")\")))","v":"ΜΑΡΑΚΗΣ Μ (Ο.Α.ΧΑΝΙΩΝ)"},"-",{"$f":"IF(MD!M27=\"\", \"\", IF(MD!M27=1, CONCATENATE(LEFT(MD!J27,FIND(\" \",MD!J27)+1),\" (\",MD!L27,\")\"),CONCATENATE(LEFT(MD!J28,FIND(\" \",MD!J28)+1),\" (\",MD!L28,\")\")))","v":"ΖΕΡΒΟΣ Σ (Ο.Α.ΧΑΝΙΩΝ)"}]
[null,{"$f":"Setup!$B$8","v":"Α12"},{"$f":"IF(MD!M29=\"\", \"\", IF(MD!M29=1, CONCATENATE(LEFT(MD!J29,FIND(\" \",MD!J29)+1),\" (\",MD!L29,\")\"),CONCATENATE(LEFT(MD!J30,FIND(\" \",MD!J30)+1),\" (\",MD!L30,\")\")))","v":"ΣΠΥΡΟΠΟΥΛΟΣ Ν (Ο.Α.ΡΕΘΥΜΝΟΥ)"},"-",{"$f":"IF(MD!M31=\"\", \"\", IF(MD!M31=1, CONCATENATE(LEFT(MD!J31,FIND(\" \",MD!J31)+1),\" (\",MD!L31,\")\"),CONCATENATE(LEFT(MD!J32,FIND(\" \",MD!J32)+1),\" (\",MD!L32,\")\")))","v":"ΤΑΒΕΡΝΑΡΑΚΗΣ Ε (ΗΡΑΚΛΕΙΟ Ο.Α.& Α.)"}]
[null,{"$f":"Setup!$B$8","v":"Α12"},{"$f":"IF(MD!M33=\"\", \"\", IF(MD!M33=1, CONCATENATE(LEFT(MD!J33,FIND(\" \",MD!J33)+1),\" (\",MD!L33,\")\"),CONCATENATE(LEFT(MD!J34,FIND(\" \",MD!J34)+1),\" (\",MD!L34,\")\")))","v":"ΚΑΫΜΕΝΑΚΗΣ Α (Ο.Α.ΧΑΝΙΩΝ)"},"-",{"$f":"IF(MD!M35=\"\", \"\", IF(MD!M35=1, CONCATENATE(LEFT(MD!J35,FIND(\" \",MD!J35)+1),\" (\",MD!L35,\")\"),CONCATENATE(LEFT(MD!J36,FIND(\" \",MD!J36)+1),\" (\",MD!L36,\")\")))","v":"ΜΑΝΔΑΛΕΝΑΚΗΣ Α (ΗΡΑΚΛΕΙΟ Ο.Α.& Α.)"}]
[]
[]
[]
[]
[]
["Don't Change this Worksheet !"]

{"sheet":"tables","index":7,"n_rows":33,"n_cols":18,"rows_kept":33,"cut":false,"hidden":false,"merged":[]}
["RndIndx","random","FixRandom",null,null,"1ος","2ος","3-4","5-8","9-16","17-32",null,null,null,null,"Category","Juniors","Serniors"]
[1,{"$f":"RAND()/222","v":1.4902448672906941E-3},2.2591646294891051E-3,null,"E1-12",30,25,15,10,7.5,5,null,null,null,null,"Α10","Α10","m35"]
[2,2.6578711671515843E-3,1.3782004344844291E-3,null,"E1-14",60,50,30,20,15,10,null,null,null,null,"Α12","Α12","m40"]
[3,{"$f":"RAND()/222","v":1.1186494110028515E-3},2.7921291534137617E-3,null,"E1-16",120,100,60,40,30,20,null,null,null,null,"Α14","Α14","m45"]
[4,{"$f":"RAND()/222","v":2.7912771211533583E-4},3.7720781966312684E-3,null,"E1-18",150,125,75,50,37.5,25,null,null,null,null,"Α16","Α16","m50"]
[5,{"$f":"RAND()/222","v":3.439461412806375E-3},1.555645607844698E-3,null,"E2-12",15,12.5,7.5,5,4,2.5,null,null,null,null,"Α18","Α18","m55"]
[6,{"$f":"RAND()/222","v":6.2160423120227986E-4},3.6701533162968075E-3,null,"E2-14",30,25,15,10,8,5,null,null,null,null,"Κ10","Κ10","m60"]
[7,{"$f":"RAND()/222","v":3.8080867788397484E-3},2.8714698777152652E-3,null,"E2-16",60,50,30,20,16,10,null,null,null,null,"Κ12","Κ12","m65"]
[8,2.1527898268387764E-4,5.1329639305528992E-4,null,"E3-12",6,5,3,2,1.5,1,null,null,null,null,"Κ14","Κ14","m70"]
[9,2.2274336259334405E-3,3.7230987475287761E-3,null,"E3-14",12,10,6,4,3,2,null,null,null,null,"Κ16","Κ16","m75"]
[10,8.7542753210281344E-4,3.7372904363756395E-3,null,"E3-16",24,20,12,8,6,4,null,null,null,null,"Κ18","Κ18","w35"]
[11,2.1208012985274825E-3,2.2698813283050239E-4,null,"E4-12",3,2.5,1.5,1,0.75,0.5,null,null,null,null,"ΑΝΔ","ΑΝΔ","w40"]
[12,1.5904410083626233E-4,4.2857185400005658E-4,null,"E4-14",6,5,3,2,1.5,1,null,null,null,null,"ΓΥΝ","ΓΥΝ","w45"]
[13,1.9946707395759084E-3,1.386922342771301E-3,null,"E4-16",12,10,6,4,3,2,null,null,null,null,"-","-","w50"]
[14,5.3554200728492393E-4,1.0703441458513113E-3,null,null,null,null,null,null,null,null,null,null,null,null,"-","-","w55"]
[15,1.6878275484579523E-3,3.1120555962469614E-3,null,null,null,null,null,null,null,null,null,null,null,null,"-","-","-"]
[16,2.6474416776322749E-3,3.357696022143745E-3]
[17,4.2285242189106674E-3,5.722843110124925E-4]
[18,9.6959297804320504E-4,8.7217198940307264E-4]
[19,2.0046675353740319E-3,5.5315349987074584E-4]
[20,2.9331628143074921E-3,2.3190634468682509E-3]
[21,4.4206162126798855E-3,2.0073761189277777E-3]
[22,3.2482348225708769E-3,1.6368810726075556E-3]
[23,3.656671765737305E-3,2.6259899448252059E-3]
[24,3.2091879406202866E-3,2.2388702272682242E-3]
[25,3.9675150542105098E-3,3.9756754636710969E-3]
[26,9.6882845257954809E-4,7.9731975291604982E-4]
[27,3.9841237155924863E-3,1.7765977383821226E-3]
[28,6.0618698533011339E-4,1.2625026270289661E-3]
[29,2.689308937871877E-3,3.1044096754783953E-3]
[30,8.213075321323065E-4,2.6234777040750365E-4]
[31,7.5985697340465739E-4,2.8952059832042252E-3]
[32,4.388530631013568E-5,2.5870982399284021E-3]

{"sheet":"matches","index":8,"n_rows":33,"n_cols":12,"rows_kept":33,"cut":false,"hidden":false,"merged":[[0,10,0,11],[0,1,0,2],[0,3,0,4]]}
["round","winner",null,"looser",null,"score",null," Player "," Position ",null,"Set-up"]
[32,{"$f":"IF(OR(MD!$M$5 =1,MD!$M$5 =2), IF(MD!$M$5 =1,MD!$I$5,MD!$I$6),\"#\")","v":31617},{"$f":"TRIM(LEFT(VLOOKUP(B2,DrawPrep!$C$3:$D$34,2,FALSE),FIND(\" \",VLOOKUP(B2,DrawPrep!$C$3:$D$34,2,FALSE),1)-1))","v":"ΜΑΤΣΑΜΑΚΗΣ"},{"$f":"IF(OR(MD!$M$5 =1,MD!$M$5 =2), IF(MD!$M$5 =2,MD!$I$5,MD!$I$6),\"#\")","v":0},{"$f":"TRIM(LEFT(VLOOKUP(D2,DrawPrep!$C$3:$D$34,2,FALSE),FIND(\" \",VLOOKUP(D2,DrawPrep!$C$3:$D$34,2,FALSE),1)-1))","v":{"$error":"#N/A"}},{"$f":"MD!O6","v":0},null,{"$f":"B32","v":31617},"1st",null,"title: ",{"$f":"Setup!$B$4","v":"3ο Ε3 2016"}]
[32,{"$f":"IF(OR(MD!$M$7 =1,MD!$M$7 =2), IF(MD!$M$7 =1,MD!$I$7,MD!$I$8),\"#\")","v":33295},{"$f":"TRIM(LEFT(VLOOKUP(B3,DrawPrep!$C$3:$D$34,2,FALSE),FIND(\" \",VLOOKUP(B3,DrawPrep!$C$3:$D$34,2,FALSE),1)-1))","v":"ΒΟΛΤΥΡΑΚΗΣ"},{"$f":"IF(OR(MD!$M$7 =1,MD!$M$7 =2), IF(MD!$M$7 =2,MD!$I$7,MD!$I$8),\"#\")","v":37805},{"$f":"TRIM(LEFT(VLOOKUP(D3,DrawPrep!$C$3:$D$34,2,FALSE),FIND(\" \",VLOOKUP(D3,DrawPrep!$C$3:$D$34,2,FALSE),1)-1))","v":"ΚΩΣΤΑΚΗΣ"},{"$f":"MD!O8","v":"54(4) 42"},null,{"$f":"D32","v":36263},"2nd",null,"grade: ",{"$f":"Setup!$B$5","v":"e3"}]
[32,{"$f":"IF(OR(MD!$M$9 =1,MD!$M$9 =2), IF(MD!$M$9 =1,MD!$I$9,MD!$I$10),\"#\")","v":36550},{"$f":"TRIM(LEFT(VLOOKUP(B4,DrawPrep!$C$3:$D$34,2,FALSE),FIND(\" \",VLOOKUP(B4,DrawPrep!$C$3:$D$34,2,FALSE),1)-1))","v":"ΠΕΡΔΙΚΑΚΗΣ"},{"$f":"IF(OR(MD!$M$9 =1,MD!$M$9 =2), IF(MD!$M$9 =2,MD!$I$9,MD!$I$10),\"#\")","v":37561},{"$f":"TRIM(LEFT(VLOOKUP(D4,DrawPrep!$C$3:$D$34,2,FALSE),FIND(\" \",VLOOKUP(D4,DrawPrep!$C$3:$D$34,2,FALSE),1)-1))","v":"ΦΟΥΝΤΟΥΛΑΚΗΣ"},{"$f":"MD!O10","v":"40 30 ret"},null,{"$f":"D30","v":36456},"3_4",null,"age: ",{"$f":"Setup!$B$6","v":12}]
[32,{"$f":"IF(OR(MD!$M$11=1,MD!$M$11=2), IF(MD!$M$11=1,MD!$I$11,MD!$I$12),\"#\")","v":32350},{"$f":"TRIM(LEFT(VLOOKUP(B5,DrawPrep!$C$3:$D$34,2,FALSE),FIND(\" \",VLOOKUP(B5,DrawPrep!$C$3:$D$34,2,FALSE),1)-1))","v":"ΠΕΤΡΑΚΗΣ"},{"$f":"IF(OR(MD!$M$11=1,MD!$M$11=2), IF(MD!$M$11=2,MD!$I$11,MD!$I$12),\"#\")","v":0},{"$f":"TRIM(LEFT(VLOOKUP(D5,DrawPrep!$C$3:$D$34,2,FALSE),FIND(\" \",VLOOKUP(D5,DrawPrep!$C$3:$D$34,2,FALSE),1)-1))","v":{"$error":"#N/A"}},{"$f":"MD!O12","v":0},null,{"$f":"D31","v":33396},"3_4",null,"category: ",{"$f":"Setup!$B$8","v":"Α12"}]
[32,{"$f":"IF(OR(MD!$M$13=1,MD!$M$13=2), IF(MD!$M$13=1,MD!$I$13,MD!$I$14),\"#\")","v":36456},{"$f":"TRIM(LEFT(VLOOKUP(B6,DrawPrep!$C$3:$D$34,2,FALSE),FIND(\" \",VLOOKUP(B6,DrawPrep!$C$3:$D$34,2,FALSE),1)-1))","v":"ΓΕΝΝΑΡΑΚΗΣ"},{"$f":"IF(OR(MD!$M$13=1,MD!$M$13=2), IF(MD!$M$13=2,MD!$I$13,MD!$I$14),\"#\")","v":0},{"$f":"TRIM(LEFT(VLOOKUP(D6,DrawPrep!$C$3:$D$34,2,FALSE),FIND(\" \",VLOOKUP(D6,DrawPrep!$C$3:$D$34,2,FALSE),1)-1))","v":{"$error":"#N/A"}},{"$f":"MD!O14","v":0},null,{"$f":"D26","v":32350},"5_8",null,"period: ",{"$f":"Setup!$B$9&\"-\"&Setup!$B$10","v":"22-23 Οκτωβρίου "}]
[32,{"$f":"IF(OR(MD!$M$15=1,MD!$M$15=2), IF(MD!$M$15=1,MD!$I$15,MD!$I$16),\"#\")","v":38042},{"$f":"TRIM(LEFT(VLOOKUP(B7,DrawPrep!$C$3:$D$34,2,FALSE),FIND(\" \",VLOOKUP(B7,DrawPrep!$C$3:$D$34,2,FALSE),1)-1))","v":"ΜΠΟΥΝΑΚΗΣ"},{"$f":"IF(OR(MD!$M$15=1,MD!$M$15=2), IF(MD!$M$15=2,MD!$I$15,MD!$I$16),\"#\")","v":37803},{"$f":"TRIM(LEFT(VLOOKUP(D7,DrawPrep!$C$3:$D$34,2,FALSE),FIND(\" \",VLOOKUP(D7,DrawPrep!$C$3:$D$34,2,FALSE),1)-1))","v":"ΚΑΛΑΤΖΗΣ"},{"$f":"MD!O16","v":"53 54(4)"},null,{"$f":"D27","v":37665},"5_8",null,"organizer: ",{"$f":"Setup!$B$3","v":"Ζ΄ ΕΝΩΣΗ"}]
[32,{"$f":"IF(OR(MD!$M$17=1,MD!$M$17=2), IF(MD!$M$17=1,MD!$I$17,MD!$I$18),\"#\")","v":37801},{"$f":"TRIM(LEFT(VLOOKUP(B8,DrawPrep!$C$3:$D$34,2,FALSE),FIND(\" \",VLOOKUP(B8,DrawPrep!$C$3:$D$34,2,FALSE),1)-1))","v":"ΚΑΡΑΚΩΣΤΑΣ"},{"$f":"IF(OR(MD!$M$17=1,MD!$M$17=2), IF(MD!$M$17=2,MD!$I$17,MD!$I$18),\"#\")","v":37800},{"$f":"TRIM(LEFT(VLOOKUP(D8,DrawPrep!$C$3:$D$34,2,FALSE),FIND(\" \",VLOOKUP(D8,DrawPrep!$C$3:$D$34,2,FALSE),1)-1))","v":"ΒΕΛΕΝΤΑΚΗΣ"},{"$f":"MD!O18","v":"40 40"},null,{"$f":"D28","v":37562},"5_8"]
[32,{"$f":"IF(OR(MD!$M$19=1,MD!$M$19=2), IF(MD!$M$19=1,MD!$I$19,MD!$I$20),\"#\")","v":37665},{"$f":"TRIM(LEFT(VLOOKUP(B9,DrawPrep!$C$3:$D$34,2,FALSE),FIND(\" \",VLOOKUP(B9,DrawPrep!$C$3:$D$34,2,FALSE),1)-1))","v":"ΚΟΚΚΙΝΑΚΗΣ"},{"$f":"IF(OR(MD!$M$19=1,MD!$M$19=2), IF(MD!$M$19=2,MD!$I$19,MD!$I$20),\"#\")","v":37990},{"$f":"TRIM(LEFT(VLOOKUP(D9,DrawPrep!$C$3:$D$34,2,FALSE),FIND(\" \",VLOOKUP(D9,DrawPrep!$C$3:$D$34,2,FALSE),1)-1))","v":"ΝΙΝΟΣ"},{"$f":"MD!O20","v":4040},null,{"$f":"D29","v":35629},"5_8"]
[32,{"$f":"IF(OR(MD!$M$21=1,MD!$M$21=2), IF(MD!$M$21=1,MD!$I$21,MD!$I$22),\"#\")","v":37032},{"$f":"TRIM(LEFT(VLOOKUP(B10,DrawPrep!$C$3:$D$34,2,FALSE),FIND(\" \",VLOOKUP(B10,DrawPrep!$C$3:$D$34,2,FALSE),1)-1))","v":"ΧΑΛΑΚΑΤΕΒΑΚΗΣ"},{"$f":"IF(OR(MD!$M$21=1,MD!$M$21=2), IF(MD!$M$21=2,MD!$I$21,MD!$I$22),\"#\")","v":0},{"$f":"TRIM(LEFT(VLOOKUP(D10,DrawPrep!$C$3:$D$34,2,FALSE),FIND(\" \",VLOOKUP(D10,DrawPrep!$C$3:$D$34,2,FALSE),1)-1))","v":{"$error":"#N/A"}},{"$f":"MD!O22","v":0},null,{"$f":"D18","v":33295},"9_16"]
[32,{"$f":"IF(OR(MD!$M$23=1,MD!$M$23=2), IF(MD!$M$23=1,MD!$I$23,MD!$I$24),\"#\")","v":37562},{"$f":"TRIM(LEFT(VLOOKUP(B11,DrawPrep!$C$3:$D$34,2,FALSE),FIND(\" \",VLOOKUP(B11,DrawPrep!$C$3:$D$34,2,FALSE),1)-1))","v":"ΣΤΡΟΜΠΑ"},{"$f":"IF(OR(MD!$M$23=1,MD!$M$23=2), IF(MD!$M$23=2,MD!$I$23,MD!$I$24),\"#\")","v":33835},{"$f":"TRIM(LEFT(VLOOKUP(D11,DrawPrep!$C$3:$D$34,2,FALSE),FIND(\" \",VLOOKUP(D11,DrawPrep!$C$3:$D$34,2,FALSE),1)-1))","v":"ΒΕΓΟΠΟΥΛΟΣ"},{"$f":"MD!O24","v":"40 42"},null,{"$f":"D19","v":36550},"9_16"]
[32,{"$f":"IF(OR(MD!$M$25=1,MD!$M$25=2), IF(MD!$M$25=1,MD!$I$25,MD!$I$26),\"#\")","v":37669},{"$f":"TRIM(LEFT(VLOOKUP(B12,DrawPrep!$C$3:$D$34,2,FALSE),FIND(\" \",VLOOKUP(B12,DrawPrep!$C$3:$D$34,2,FALSE),1)-1))","v":"ΜΑΡΑΚΗΣ"},{"$f":"IF(OR(MD!$M$25=1,MD!$M$25=2), IF(MD!$M$25=2,MD!$I$25,MD!$I$26),\"#\")","v":37471},{"$f":"TRIM(LEFT(VLOOKUP(D12,DrawPrep!$C$3:$D$34,2,FALSE),FIND(\" \",VLOOKUP(D12,DrawPrep!$C$3:$D$34,2,FALSE),1)-1))","v":"ΞΙΑΡΧΟΣ"},{"$f":"MD!O26","v":"40 54(0)"},null,38042,"9_16"]
[32,{"$f":"IF(OR(MD!$M$27=1,MD!$M$27=2), IF(MD!$M$27=1,MD!$I$27,MD!$I$28),\"#\")","v":33396},{"$f":"TRIM(LEFT(VLOOKUP(B13,DrawPrep!$C$3:$D$34,2,FALSE),FIND(\" \",VLOOKUP(B13,DrawPrep!$C$3:$D$34,2,FALSE),1)-1))","v":"ΖΕΡΒΟΣ"},{"$f":"IF(OR(MD!$M$27=1,MD!$M$27=2), IF(MD!$M$27=2,MD!$I$27,MD!$I$28),\"#\")","v":0},{"$f":"TRIM(LEFT(VLOOKUP(D13,DrawPrep!$C$3:$D$34,2,FALSE),FIND(\" \",VLOOKUP(D13,DrawPrep!$C$3:$D$34,2,FALSE),1)-1))","v":{"$error":"#N/A"}},{"$f":"MD!O28","v":0},null,37801,"9_16"]
[32,{"$f":"IF(OR(MD!$M$29=1,MD!$M$29=2), IF(MD!$M$29=1,MD!$I$29,MD!$I$30),\"#\")","v":35629},{"$f":"TRIM(LEFT(VLOOKUP(B14,DrawPrep!$C$3:$D$34,2,FALSE),FIND(\" \",VLOOKUP(B14,DrawPrep!$C$3:$D$34,2,FALSE),1)-1))","v":"ΣΠΥΡΟΠΟΥΛΟΣ"},{"$f":"IF(OR(MD!$M$29=1,MD!$M$29=2), IF(MD!$M$29=2,MD!$I$29,MD!$I$30),\"#\")","v":38017},{"$f":"TRIM(LEFT(VLOOKUP(D14,DrawPrep!$C$3:$D$34,2,FALSE),FIND(\" \",VLOOKUP(D14,DrawPrep!$C$3:$D$34,2,FALSE),1)-1))","v":"ΝΕΚΤΑΡΙΟΣ"},{"$f":"MD!O30","v":"40 40"},null,37032,"9_16"]
[32,{"$f":"IF(OR(MD!$M$31=1,MD!$M$31=2), IF(MD!$M$31=1,MD!$I$31,MD!$I$32),\"#\")","v":38697},{"$f":"TRIM(LEFT(VLOOKUP(B15,DrawPrep!$C$3:$D$34,2,FALSE),FIND(\" \",VLOOKUP(B15,DrawPrep!$C$3:$D$34,2,FALSE),1)-1))","v":"ΤΑΒΕΡΝΑΡΑΚΗΣ"},{"$f":"IF(OR(MD!$M$31=1,MD!$M$31=2), IF(MD!$M$31=2,MD!$I$31,MD!$I$32),\"#\")","v":33985},{"$f":"TRIM(LEFT(VLOOKUP(D15,DrawPrep!$C$3:$D$34,2,FALSE),FIND(\" \",VLOOKUP(D15,DrawPrep!$C$3:$D$34,2,FALSE),1)-1))","v":"ΤΣΙΤΟΥΝΗΣ"},{"$f":"MD!O32","v":"53 42"},null,37669,"9_16"]
[32,{"$f":"IF(OR(MD!$M$33=1,MD!$M$33=2), IF(MD!$M$33=1,MD!$I$33,MD!$I$34),\"#\")","v":37664},{"$f":"TRIM(LEFT(VLOOKUP(B16,DrawPrep!$C$3:$D$34,2,FALSE),FIND(\" \",VLOOKUP(B16,DrawPrep!$C$3:$D$34,2,FALSE),1)-1))","v":"ΚΑΫΜΕΝΑΚΗΣ"},{"$f":"IF(OR(MD!$M$33=1,MD!$M$33=2), IF(MD!$M$33=2,MD!$I$33,MD!$I$34),\"#\")","v":36616},{"$f":"TRIM(LEFT(VLOOKUP(D16,DrawPrep!$C$3:$D$34,2,FALSE),FIND(\" \",VLOOKUP(D16,DrawPrep!$C$3:$D$34,2,FALSE),1)-1))","v":"ΚΟΚΚΑΛΗΣ"},{"$f":"MD!O34","v":"40 42"},null,38697,"9_16"]
[32,{"$f":"IF(OR(MD!$M$35=1,MD!$M$35=2), IF(MD!$M$35=1,MD!$I$35,MD!$I$36),\"#\")","v":36263},{"$f":"TRIM(LEFT(VLOOKUP(B17,DrawPrep!$C$3:$D$34,2,FALSE),FIND(\" \",VLOOKUP(B17,DrawPrep!$C$3:$D$34,2,FALSE),1)-1))","v":"ΜΑΝΔΑΛΕΝΑΚΗΣ"},{"$f":"IF(OR(MD!$M$35=1,MD!$M$35=2), IF(MD!$M$35=2,MD!$I$35,MD!$I$36),\"#\")","v":0},{"$f":"TRIM(LEFT(VLOOKUP(D17,DrawPrep!$C$3:$D$34,2,FALSE),FIND(\" \",VLOOKUP(D17,DrawPrep!$C$3:$D$34,2,FALSE),1)-1))","v":{"$error":"#N/A"}},{"$f":"MD!O36","v":0},null,37664,"9_16"]
[16,{"$f":"IF(OR(MD!$P$6 =1,MD!$P$6 =2), IF(MD!$P$6 =1,MD!$N$5,MD!$N$7),\"#\")","v":31617},{"$f":"TRIM(LEFT(VLOOKUP(B18,DrawPrep!$C$3:$D$34,2,FALSE),FIND(\" \",VLOOKUP(B18,DrawPrep!$C$3:$D$34,2,FALSE),1)-1))","v":"ΜΑΤΣΑΜΑΚΗΣ"},{"$f":"IF(OR(MD!$P$6 =1,MD!$P$6 =2), IF(MD!$P$6 =2,MD!$N$5,MD!$N$7),\"#\")","v":33295},{"$f":"TRIM(LEFT(VLOOKUP(D18,DrawPrep!$C$3:$D$34,2,FALSE),FIND(\" \",VLOOKUP(D18,DrawPrep!$C$3:$D$34,2,FALSE),1)-1))","v":"ΒΟΛΤΥΡΑΚΗΣ"},{"$f":"MD!R7","v":"40 40"},null,{"$f":"D2","v":0},"17_32"]
[16,{"$f":"IF(OR(MD!$P$10=1,MD!$P$10=2), IF(MD!$P$10=1,MD!$N$9,MD!$N$11),\"#\")","v":32350},{"$f":"TRIM(LEFT(VLOOKUP(B19,DrawPrep!$C$3:$D$34,2,FALSE),FIND(\" \",VLOOKUP(B19,DrawPrep!$C$3:$D$34,2,FALSE),1)-1))","v":"ΠΕΤΡΑΚΗΣ"},{"$f":"IF(OR(MD!$P$10=1,MD!$P$10=2), IF(MD!$P$10=2,MD!$N$9,MD!$N$11),\"#\")","v":36550},{"$f":"TRIM(LEFT(VLOOKUP(D19,DrawPrep!$C$3:$D$34,2,FALSE),FIND(\" \",VLOOKUP(D19,DrawPrep!$C$3:$D$34,2,FALSE),1)-1))","v":"ΠΕΡΔΙΚΑΚΗΣ"},{"$f":"MD!R11","v":"42 41"},null,{"$f":"D3","v":37805},"17_32"]
[16,{"$f":"IF(OR(MD!$P$14=1,MD!$P$14=2), IF(MD!$P$14=1,MD!$N$13,MD!$N$15),\"#\")","v":36456},{"$f":"TRIM(LEFT(VLOOKUP(B20,DrawPrep!$C$3:$D$34,2,FALSE),FIND(\" \",VLOOKUP(B20,DrawPrep!$C$3:$D$34,2,FALSE),1)-1))","v":"ΓΕΝΝΑΡΑΚΗΣ"},{"$f":"IF(OR(MD!$P$14=1,MD!$P$14=2), IF(MD!$P$14=2,MD!$N$13,MD!$N$15),\"#\")","v":38042},{"$f":"TRIM(LEFT(VLOOKUP(D20,DrawPrep!$C$3:$D$34,2,FALSE),FIND(\" \",VLOOKUP(D20,DrawPrep!$C$3:$D$34,2,FALSE),1)-1))","v":"ΜΠΟΥΝΑΚΗΣ"},{"$f":"MD!R15","v":"42 40"},null,37561,"17_32"]
[16,{"$f":"IF(OR(MD!$P$18=1,MD!$P$18=2), IF(MD!$P$18=1,MD!$N$17,MD!$N$19),\"#\")","v":37665},{"$f":"TRIM(LEFT(VLOOKUP(B21,DrawPrep!$C$3:$D$34,2,FALSE),FIND(\" \",VLOOKUP(B21,DrawPrep!$C$3:$D$34,2,FALSE),1)-1))","v":"ΚΟΚΚΙΝΑΚΗΣ"},{"$f":"IF(OR(MD!$P$18=1,MD!$P$18=2), IF(MD!$P$18=2,MD!$N$17,MD!$N$19),\"#\")","v":37801},{"$f":"TRIM(LEFT(VLOOKUP(D21,DrawPrep!$C$3:$D$34,2,FALSE),FIND(\" \",VLOOKUP(D21,DrawPrep!$C$3:$D$34,2,FALSE),1)-1))","v":"ΚΑΡΑΚΩΣΤΑΣ"},{"$f":"MD!R19","v":"40 41"},null,0,"17_32"]
[16,{"$f":"IF(OR(MD!$P$22=1,MD!$P$22=2), IF(MD!$P$22=1,MD!$N$21,MD!$N$23),\"#\")","v":37562},{"$f":"TRIM(LEFT(VLOOKUP(B22,DrawPrep!$C$3:$D$34,2,FALSE),FIND(\" \",VLOOKUP(B22,DrawPrep!$C$3:$D$34,2,FALSE),1)-1))","v":"ΣΤΡΟΜΠΑ"},{"$f":"IF(OR(MD!$P$22=1,MD!$P$22=2), IF(MD!$P$22=2,MD!$N$21,MD!$N$23),\"#\")","v":37032},{"$f":"TRIM(LEFT(VLOOKUP(D22,DrawPrep!$C$3:$D$34,2,FALSE),FIND(\" \",VLOOKUP(D22,DrawPrep!$C$3:$D$34,2,FALSE),1)-1))","v":"ΧΑΛΑΚΑΤΕΒΑΚΗΣ"},{"$f":"MD!R23","v":"42 14 (10-8)"},null,0,"17_32"]
[16,{"$f":"IF(OR(MD!$P$26=1,MD!$P$26=2), IF(MD!$P$26=1,MD!$N$25,MD!$N$27),\"#\")","v":33396},{"$f":"TRIM(LEFT(VLOOKUP(B23,DrawPrep!$C$3:$D$34,2,FALSE),FIND(\" \",VLOOKUP(B23,DrawPrep!$C$3:$D$34,2,FALSE),1)-1))","v":"ΖΕΡΒΟΣ"},{"$f":"IF(OR(MD!$P$26=1,MD!$P$26=2), IF(MD!$P$26=2,MD!$N$25,MD!$N$27),\"#\")","v":37669},{"$f":"TRIM(LEFT(VLOOKUP(D23,DrawPrep!$C$3:$D$34,2,FALSE),FIND(\" \",VLOOKUP(D23,DrawPrep!$C$3:$D$34,2,FALSE),1)-1))","v":"ΜΑΡΑΚΗΣ"},{"$f":"MD!R27","v":"41 42"},null,37803,"17_32"]
[16,{"$f":"IF(OR(MD!$P$30=1,MD!$P$30=2), IF(MD!$P$30=1,MD!$N$29,MD!$N$31),\"#\")","v":35629},{"$f":"TRIM(LEFT(VLOOKUP(B24,DrawPrep!$C$3:$D$34,2,FALSE),FIND(\" \",VLOOKUP(B24,DrawPrep!$C$3:$D$34,2,FALSE),1)-1))","v":"ΣΠΥΡΟΠΟΥΛΟΣ"},{"$f":"IF(OR(MD!$P$30=1,MD!$P$30=2), IF(MD!$P$30=2,MD!$N$29,MD!$N$31),\"#\")","v":38697},{"$f":"TRIM(LEFT(VLOOKUP(D24,DrawPrep!$C$3:$D$34,2,FALSE),FIND(\" \",VLOOKUP(D24,DrawPrep!$C$3:$D$34,2,FALSE),1)-1))","v":"ΤΑΒΕΡΝΑΡΑΚΗΣ"},{"$f":"MD!R31","v":"41 40"},null,37800,"17_32"]
[16,{"$f":"IF(OR(MD!$P$34=1,MD!$P$34=2), IF(MD!$P$34=1,MD!$N$33,MD!$N$35),\"#\")","v":36263},{"$f":"TRIM(LEFT(VLOOKUP(B25,DrawPrep!$C$3:$D$34,2,FALSE),FIND(\" \",VLOOKUP(B25,DrawPrep!$C$3:$D$34,2,FALSE),1)-1))","v":"ΜΑΝΔΑΛΕΝΑΚΗΣ"},{"$f":"IF(OR(MD!$P$34=1,MD!$P$34=2), IF(MD!$P$34=2,MD!$N$33,MD!$N$35),\"#\")","v":37664},{"$f":"TRIM(LEFT(VLOOKUP(D25,DrawPrep!$C$3:$D$34,2,FALSE),FIND(\" \",VLOOKUP(D25,DrawPrep!$C$3:$D$34,2,FALSE),1)-1))","v":"ΚΑΫΜΕΝΑΚΗΣ"},{"$f":"MD!R35","v":"42 42"},null,37990,"17_32"]
[8,{"$f":"IF(OR(MD!$S$8 =1,MD!$S$8 =2), IF(MD!$S$8 =1,MD!$Q$6,MD!$Q$10),\"#\")","v":31617},{"$f":"TRIM(LEFT(VLOOKUP(B26,DrawPrep!$C$3:$D$34,2,FALSE),FIND(\" \",VLOOKUP(B26,DrawPrep!$C$3:$D$34,2,FALSE),1)-1))","v":"ΜΑΤΣΑΜΑΚΗΣ"},{"$f":"IF(OR(MD!$S$8 =1,MD!$S$8 =2), IF(MD!$S$8 =2,MD!$Q$6,MD!$Q$10),\"#\")","v":32350},{"$f":"TRIM(LEFT(VLOOKUP(D26,DrawPrep!$C$3:$D$34,2,FALSE),FIND(\" \",VLOOKUP(D26,DrawPrep!$C$3:$D$34,2,FALSE),1)-1))","v":"ΠΕΤΡΑΚΗΣ"},{"$f":"MD!U9","v":"40 41"},null,0,"17_32"]
[8,{"$f":"IF(OR(MD!$S$16=1,MD!$S$16=2), IF(MD!$S$16=1,MD!$Q$14,MD!$Q$18),\"#\")","v":36456},{"$f":"TRIM(LEFT(VLOOKUP(B27,DrawPrep!$C$3:$D$34,2,FALSE),FIND(\" \",VLOOKUP(B27,DrawPrep!$C$3:$D$34,2,FALSE),1)-1))","v":"ΓΕΝΝΑΡΑΚΗΣ"},{"$f":"IF(OR(MD!$S$16=1,MD!$S$16=2), IF(MD!$S$16=2,MD!$Q$14,MD!$Q$18),\"#\")","v":37665},{"$f":"TRIM(LEFT(VLOOKUP(D27,DrawPrep!$C$3:$D$34,2,FALSE),FIND(\" \",VLOOKUP(D27,DrawPrep!$C$3:$D$34,2,FALSE),1)-1))","v":"ΚΟΚΚΙΝΑΚΗΣ"},{"$f":"MD!U17","v":"54(10) 53"},null,33835,"17_32"]
[8,{"$f":"IF(OR(MD!$S$24=1,MD!$S$24=2), IF(MD!$S$24=1,MD!$Q$22,MD!$Q$26),\"#\")","v":33396},{"$f":"TRIM(LEFT(VLOOKUP(B28,DrawPrep!$C$3:$D$34,2,FALSE),FIND(\" \",VLOOKUP(B28,DrawPrep!$C$3:$D$34,2,FALSE),1)-1))","v":"ΖΕΡΒΟΣ"},{"$f":"IF(OR(MD!$S$24=1,MD!$S$24=2), IF(MD!$S$24=2,MD!$Q$22,MD!$Q$26),\"#\")","v":37562},{"$f":"TRIM(LEFT(VLOOKUP(D28,DrawPrep!$C$3:$D$34,2,FALSE),FIND(\" \",VLOOKUP(D28,DrawPrep!$C$3:$D$34,2,FALSE),1)-1))","v":"ΣΤΡΟΜΠΑ"},{"$f":"MD!U25","v":"40 41"},null,37471,"17_32"]
[8,{"$f":"IF(OR(MD!$S$32=1,MD!$S$32=2), IF(MD!$S$32=1,MD!$Q$30,MD!$Q$34),\"#\")","v":36263},{"$f":"TRIM(LEFT(VLOOKUP(B29,DrawPrep!$C$3:$D$34,2,FALSE),FIND(\" \",VLOOKUP(B29,DrawPrep!$C$3:$D$34,2,FALSE),1)-1))","v":"ΜΑΝΔΑΛΕΝΑΚΗΣ"},{"$f":"IF(OR(MD!$S$32=1,MD!$S$32=2), IF(MD!$S$32=2,MD!$Q$30,MD!$Q$34),\"#\")","v":35629},{"$f":"TRIM(LEFT(VLOOKUP(D29,DrawPrep!$C$3:$D$34,2,FALSE),FIND(\" \",VLOOKUP(D29,DrawPrep!$C$3:$D$34,2,FALSE),1)-1))","v":"ΣΠΥΡΟΠΟΥΛΟΣ"},{"$f":"MD!U33","v":"40 40"},null,0,"17_32"]
[4,{"$f":"IF(OR(MD!$V$12=1,MD!$V$12=2), IF(MD!$V$12=1,MD!$T$8,MD!$T$16),\"#\")","v":31617},{"$f":"TRIM(LEFT(VLOOKUP(B30,DrawPrep!$C$3:$D$34,2,FALSE),FIND(\" \",VLOOKUP(B30,DrawPrep!$C$3:$D$34,2,FALSE),1)-1))","v":"ΜΑΤΣΑΜΑΚΗΣ"},{"$f":"IF(OR(MD!$V$12=1,MD!$V$12=2), IF(MD!$V$12=2,MD!$T$8,MD!$T$16),\"#\")","v":36456},{"$f":"TRIM(LEFT(VLOOKUP(D30,DrawPrep!$C$3:$D$34,2,FALSE),FIND(\" \",VLOOKUP(D30,DrawPrep!$C$3:$D$34,2,FALSE),1)-1))","v":"ΓΕΝΝΑΡΑΚΗΣ"},{"$f":"MD!X13","v":"61 63"},null,38017,"17_32"]
[4,{"$f":"IF(OR(MD!$V$28=1,MD!$V$28=2), IF(MD!$V$28=1,MD!$T$24,MD!$T$32),\"#\")","v":36263},{"$f":"TRIM(LEFT(VLOOKUP(B31,DrawPrep!$C$3:$D$34,2,FALSE),FIND(\" \",VLOOKUP(B31,DrawPrep!$C$3:$D$34,2,FALSE),1)-1))","v":"ΜΑΝΔΑΛΕΝΑΚΗΣ"},{"$f":"IF(OR(MD!$V$28=1,MD!$V$28=2), IF(MD!$V$28=2,MD!$T$24,MD!$T$32),\"#\")","v":33396},{"$f":"TRIM(LEFT(VLOOKUP(D31,DrawPrep!$C$3:$D$34,2,FALSE),FIND(\" \",VLOOKUP(D31,DrawPrep!$C$3:$D$34,2,FALSE),1)-1))","v":"ΖΕΡΒΟΣ"},{"$f":"MD!X29","v":"46 76(7) 60"},null,33985,"17_32"]
[2,{"$f":"IF(OR(MD!$V$20=1,MD!$V$20=2), IF(MD!$V$20=1,MD!$W$12,MD!$W$28),\"#\")","v":31617},{"$f":"TRIM(LEFT(VLOOKUP(B32,DrawPrep!$C$3:$D$34,2,FALSE),FIND(\" \",VLOOKUP(B32,DrawPrep!$C$3:$D$34,2,FALSE),1)-1))","v":"ΜΑΤΣΑΜΑΚΗΣ"},{"$f":"IF(OR(MD!$V$20=1,MD!$V$20=2), IF(MD!$V$20=2,MD!$W$12,MD!$W$28),\"#\")","v":36263},{"$f":"TRIM(LEFT(VLOOKUP(D32,DrawPrep!$C$3:$D$34,2,FALSE),FIND(\" \",VLOOKUP(D32,DrawPrep!$C$3:$D$34,2,FALSE),1)-1))","v":"ΜΑΝΔΑΛΕΝΑΚΗΣ"},{"$f":"MD!X21","v":"62 62"},null,36616,"17_32"]
[null,null,null,null,null,null,null,{"$f":"D17","v":0},"17_32"]