{"text_format":"1","workbook":"xlsx","n_sheets":9,"sheets":["Setup","DrawPrep","MD","Day1","Day2","notes","PrgPrep","tables","matches"],"not_rendered":{"charts":0,"images":0,"macros":1,"external_links":0,"defined_names":3,"comments":0,"pivot_tables":0},"unopened":[],"bounds":{"document_bytes":16777216,"sheet_cells":100000,"rows_first":2000,"rows_last":500,"rows_between":2000,"halvings":0,"cell_chars":16384,"cell_head_chars":4096},"cells_cut":0,"cells_raw":0,"read":"whole","date_system":"1900"}

{"sheet":"Setup","index":0,"n_rows":34,"n_cols":12,"rows_kept":34,"cut":false,"hidden":false,"merged":[[1,3,2,3],[4,3,7,3]]}
["Μέγεθος ταμπλό: ",32,null,"Θέσεις","seed",null,null,0,"seed","space pos","Index","Value"]
[null,null,null,"3-4",{"$f":"VALUE(LEFT(F2,1))","v":3},"3 4",null,{"$f":"IF(I2=\"-\",\"-\",IF(I2>0,H1+1,0))","v":0},{"$f":"IF(J2>0,VALUE(MID($A$32,1,J2-1)),\"-\")","v":0},{"$f":"IF(LEN($A$32)>1,FIND(\" \",$A$32,1),0)","v":2},0,0]
["Διοργανωτής: ","Ζ΄ ΕΝΩΣΗ",null,null,{"$f":"VALUE(RIGHT(F2,1))","v":4},null,null,0,{"$f":"IF(J3>0,VALUE(MID($A$32,J2+1,J3-J2-1)),\"-\")","v":0},{"$f":"IF(AND(J2>0,LEN($A$32)>J2+1),FIND(\" \",$A$32,J2+1),0)","v":4},0,0]
["Τίτλος Τουρνουά: ","3ο Ε3 2016",null,"Θέσεις","seed",null,null,0,0,6,0,0]
["grade: ","e3",null,"5-8",{"$f":"TRIM(LEFT(F5,(FIND(\" \",F5,1)-1)))","v":"6"},"6 7 5 8",null,0,0,8,0,0]
["age: ",12,null,null,{"$f":"TRIM(MID(F5,(FIND(\" \",F5,1)),FIND(\" \",F5,(FIND(\" \",F5,1)+1))-(FIND(\" \",F5,1))))","v":"7"},null,null,0,0,10,0,0]
["Έδρα αγώνων: ","Γ.Σ. ΛΙΒΥΚΟΣ ΙΕΡΑΠ.",null,null,{"$f":"TRIM(MID(F5, (FIND(\" \",F5,(FIND(\" \",F5,1)+1))+1), (FIND(\" \",F5,(FIND(\" \",F5,(FIND(\" \",F5,1)+1))+1)))-(FIND(\" \",F5,(FIND(\" \",F5,1)+1))+1)))","v":"5"},null,null,0,0,12,0,0]
["Κατηγορία: ","Α12",null,null,{"$f":"TRIM(RIGHT(F5,LEN(F5)-(FIND(\" \",F5,(FIND(\" \",F5,(FIND(\" \",F5,1)+1))+1)))))","v":"8"},null,null,1,1,14,1,1]
["Έναρξη: ","22",null,null,null,null,null,2,2,16,2,2]
["Λήξη: ","23 Οκτωβρίου ",null,null,null,null,null,3,3,18,3,3]
{"$rows_left_out":25}
{"sheet":"DrawPrep","index":1,"n_rows":43,"n_cols":10,"rows_kept":43,"cut":false,"hidden":false,"merged":[[36,1,36,3]]}
[{"$f":"Setup!$B$3 & \", \" & Setup!$B$4 & \", \" & Setup!$B$7 & \", \" & Setup!$B$9 & \"-\" & Setup!$B$10","v":"Ζ΄ ΕΝΩΣΗ, 3ο Ε3 2016, Γ.Σ. ΛΙΒΥΚΟΣ ΙΕΡΑΠ., 22-23 Οκτωβρίου "},null,null,null,null,null,null,{"$f":"Setup!B8","v":"Α12"}]
["α/α","από","Α.Μ.","Ονοματεπώνυμο","Σύλλογος","βαθμοί","Τηλέφωνο","Υπογραφή","SortPts","Rnd"]
[1,null,31617,"ΜΑΤΣΑΜΑΚΗΣ ΕΛΕΥΘΕΡΙΟΣ","Ο.Α.ΧΑΝΙΩΝ",41,null,null,{"$f":"IF(D3>\" \",F3+J3,0)","v":41.002259164629486},2.2591646294891051E-3]
[2,null,36263,"ΜΑΝΔΑΛΕΝΑΚΗΣ ΑΝΑΣΤΑΣΙΟΣ","ΗΡΑΚΛΕΙΟ Ο.Α.& Α.",28,null,null,28.001378200434484,1.3782004344844291E-3]
[3,null,36456,"ΓΕΝΝΑΡΑΚΗΣ ΝΙΚΟΛΑΟΣ","ΗΡΑΚΛΕΙΟ Ο.Α.& Α.",26,null,null,26.002792129153413,2.7921291534137617E-3]
[4,null,33396,"ΖΕΡΒΟΣ ΣΤΥΛΙΑΝΟΣ","Ο.Α.ΧΑΝΙΩΝ",21.5,null,null,21.503772078196633,3.7720781966312684E-3]
[5,null,37032,"ΧΑΛΑΚΑΤΕΒΑΚΗΣ ΑΠΟΣΤΟΛΟΣ","Ο.Α.ΧΑΝΙΩΝ",19.5,null,null,19.501555645607844,1.555645607844698E-3]
[6,null,32350,"ΠΕΤΡΑΚΗΣ ΣΤΥΛΙΑΝΟΣ","Ο.Α.ΧΑΝΙΩΝ",17.5,null,null,17.503670153316296,3.6701533162968075E-3]
[7,null,37665,"ΚΟΚΚΙΝΑΚΗΣ ΓΕΩΡΓΙΟΣ","Ο.Α.ΧΑΝΙΩΝ",17,null,null,17.002871469877714,2.8714698777152652E-3]
[8,null,35629,"ΣΠΥΡΟΠΟΥΛΟΣ ΝΙΚΟΛΑΟΣ","Ο.Α.ΡΕΘΥΜΝΟΥ",14.5,null,null,14.500513296393056,5.1329639305528992E-4]
{"$rows_left_out":34}
{"sheet":"MD","index":2,"n_rows":66,"n_cols":24,"rows_kept":66,"cut":false,"hidden":false,"merged":[[0,0,0,20],[2,9,2,11],[40,20,40,23]]}
[{"$f":"Setup!B3 & \", \" & Setup!B4 & \", \" & Setup!B7 & \", \" & Setup!B9 & \"-\" & Setup!B10","v":"Ζ΄ ΕΝΩΣΗ, 3ο Ε3 2016, Γ.Σ. ΛΙΒΥΚΟΣ ΙΕΡΑΠ., 22-23 Οκτωβρίου "},null,null,null,null,null,null,null,null,null,null,null,null,null,null,null,null,null,null,null,null,null,null,{"$f":"Setup!B8","v":"Α12"}]
[null,{"$f":"Setup!B18","v":6}]
[null,null,null,null,null,null,null,null,null,32,null,null,null,null,16,null,null,8,null,null,4,null,null,"2 & w"]
["α/α",null,"ByeOrder","ByeSum","ByeCnt","από","seed","Pts","Α.Μ.","Ονοματεπώνυμο","επώνυμο","Σύλλογος"]
[1,1,null,null,0,{"$f":"IF(NOT($G5=\"-\"),VLOOKUP($G5,DrawPrep!$A$3:$F$34,2,FALSE),\"\")","v":0},{"$f":"VLOOKUP($B5,Setup!$K$2:$L$33,2,FALSE)","v":1},{"$f":"IF($G5>0,VLOOKUP($G5,DrawPrep!$A$3:$F$34,6,FALSE),0)","v":41},{"$f":"IF(Setup!$B$24=\"#\",0,IF($G5>0,VLOOKUP($G5,DrawPrep!$A$3:$F$34,3,FALSE),0))","v":31617},{"$f":"IF($I5>0,VLOOKUP($I5,DrawPrep!$C$3:$F$34,2,FALSE),\"bye\")","v":"ΜΑΤΣΑΜΑΚΗΣ ΕΛΕΥΘΕΡΙΟΣ"},{"$f":"IF(NOT(I5>0),\"\", IF(ISERROR(FIND(\"-\",J5)), LEFT(J5,FIND(\" \",J5)-1), IF(FIND(\"-\",J5)>FIND(\" \",J5),LEFT(J5,FIND(\" \",J5)-1), LEFT(J5,FIND(\"-\",J5)-1) )))","v":"ΜΑΤΣΑΜΑΚΗΣ"},{"$f":"IF($I5>0,VLOOKUP($I5,DrawPrep!$C$3:$F$34,3,FALSE),\"\")","v":"Ο.Α.ΧΑΝΙΩΝ"},1,{"$f":"IF((OR(M5=1,M5=2)),IF(M5=1,I5,I6),\"\")","v":31617},{"$f":"UPPER(IF($A$2=\"R\",IF(OR(M5=1,M5=\"a\"),I5,IF(OR(M5=2,M5=\"b\"),I6,\"\")),IF(OR(M5=1,M5=\"1\"),K5,IF(OR(M5=2,M5=\"b\"),K6,\"\"))))","v":"ΜΑΤΣΑΜΑΚΗΣ"}]
[2,{"$f":"1-D6+8","v":8},{"$f":"B5","v":1},{"$f":"E6","v":1},{"$f":"IF($B$2>=C6,1,0)","v":1},{"$f":"IF(NOT($G6=\"-\"),VLOOKUP($G6,DrawPrep!$A$3:$F$34,2,FALSE),\"\")","v":""},{"$f":"IF($B$2>=C6,\"-\",VLOOKUP($B6,Setup!$K$2:$L$33,2,FALSE))","v":"-"},{"$f":"IF(NOT($G6=\"-\"),VLOOKUP($G6,DrawPrep!$A$3:$F$34,6,FALSE),0)","v":0},{"$f":"IF(Setup!$B$24=\"#\",0,IF(NOT($G6=\"-\"),VLOOKUP($G6,DrawPrep!$A$3:$F$34,3,FALSE),0))","v":0},{"$f":"IF($I6>0,VLOOKUP($I6,DrawPrep!$C$3:$F$34,2,FALSE),\"bye\")","v":"bye"},{"$f":"IF(NOT(I6>0),\"\", IF(ISERROR(FIND(\"-\",J6)), LEFT(J6,FIND(\" \",J6)-1), IF(FIND(\"-\",J6)>FIND(\" \",J6),LEFT(J6,FIND(\" \",J6)-1), LEFT(J6,FIND(\"-\",J6)-1) )))","v":""},{"$f":"IF($I6>0,VLOOKUP($I6,DrawPrep!$C$3:$F$34,3,FALSE),\"\")","v":""},null,null,null,1,{"$f":"IF((OR(P6=1,P6=2)),IF(P6=1,N5,N7),\"\")","v":31617},{"$f":"UPPER(IF($A$2=\"R\",IF(OR(P6=1,P6=\"a\"),O5,IF(OR(P6=2,P6=\"b\"),O7,\"\")),IF(OR(P6=1,P6=\"a\"),O5,IF(OR(P6=2,P6=\"b\"),O7,\"\"))))","v":"ΜΑΤΣΑΜΑΚΗΣ"}]
[3,{"$f":"2-D7+8","v":9},null,{"$f":"D6+E7","v":1},0,{"$f":"IF(NOT($G7=\"-\"),VLOOKUP($G7,DrawPrep!$A$3:$F$34,2,FALSE),\"\")","v":0},{"$f":"VLOOKUP($B7,Setup!$K$2:$L$33,2,FALSE)","v":18},{"$f":"IF($G7>0,VLOOKUP($G7,DrawPrep!$A$3:$F$34,6,FALSE),0)","v":1},{"$f":"IF(Setup!$B$24=\"#\",0,IF($G7>0,VLOOKUP($G7,DrawPrep!$A$3:$F$34,3,FALSE),0))","v":37805},{"$f":"IF($I7>0,VLOOKUP($I7,DrawPrep!$C$3:$F$34,2,FALSE),\"bye\")","v":"ΚΩΣΤΑΚΗΣ ΕΜΜΑΝΟΥΗΛ"},"ΚΩΣΤΑΚΗΣ",{"$f":"IF($I7>0,VLOOKUP($I7,DrawPrep!$C$3:$F$34,3,FALSE),\"\")","v":"ΗΡΑΚΛΕΙΟ Ο.Α.& Α."},2,{"$f":"IF((OR(M7=1,M7=2)),IF(M7=1,I7,I8),\"\")","v":33295},{"$f":"UPPER(IF($A$2=\"R\",IF(OR(M7=1,M7=\"a\"),I7,IF(OR(M7=2,M7=\"b\"),I8,\"\")),IF(OR(M7=1,M7=\"a\"),K7,IF(OR(M7=2,M7=\"b\"),K8,\"\"))))","v":"ΒΟΛΤΥΡΑΚΗΣ"},null,null,"40 40"]
[4,{"$f":"3-D8+8","v":10},15,{"$f":"D7+E8","v":1},{"$f":"IF($B$2>=C8,1,0)","v":0},{"$f":"IF(NOT($G8=\"-\"),VLOOKUP($G8,DrawPrep!$A$3:$F$34,2,FALSE),\"\")","v":0},{"$f":"IF($B$2>=C8,\"-\",VLOOKUP($B8,Setup!$K$2:$L$33,2,FALSE))","v":9},{"$f":"IF(NOT($G8=\"-\"),VLOOKUP($G8,DrawPrep!$A$3:$F$34,6,FALSE),0)","v":13},{"$f":"IF(Setup!$B$24=\"#\",0,IF(NOT($G8=\"-\"),VLOOKUP($G8,DrawPrep!$A$3:$F$34,3,FALSE),0))","v":33295},{"$f":"IF($I8>0,VLOOKUP($I8,DrawPrep!$C$3:$F$34,2,FALSE),\"bye\")","v":"ΒΟΛΤΥΡΑΚΗΣ ΕΥΤΥΧΙΟΣ"},"ΒΟΛΤΥΡΑΚΗΣ",{"$f":"IF($I8>0,VLOOKUP($I8,DrawPrep!$C$3:$F$34,3,FALSE),\"\")","v":"Ο.Α.ΧΑΝΙΩΝ"},null,null,"54(4) 42",null,null,null,1,{"$f":"IF((OR(S8=1,S8=2)),IF(S8=1,Q6,Q10),\"\")","v":31617},{"$f":"UPPER(IF($A$2=\"R\",IF(OR(S8=1,S8=\"a\"),R6,IF(OR(S8=2,S8=\"b\"),R10,\"\")),IF(OR(S8=1,S8=\"a\"),R6,IF(OR(S8=2,S8=\"b\"),R10,\"\"))))","v":"ΜΑΤΣΑΜΑΚΗΣ"}]
[5,{"$f":"4-D9+8","v":11},null,1,0,{"$f":"IF(NOT($G9=\"-\"),VLOOKUP($G9,DrawPrep!$A$3:$F$34,2,FALSE),\"\")","v":0},{"$f":"VLOOKUP($B9,Setup!$K$2:$L$33,2,FALSE)","v":10},{"$f":"IF($G9>0,VLOOKUP($G9,DrawPrep!$A$3:$F$34,6,FALSE),0)","v":11},{"$f":"IF(Setup!$B$24=\"#\",0,IF($G9>0,VLOOKUP($G9,DrawPrep!$A$3:$F$34,3,FALSE),0))","v":36550},{"$f":"IF($I9>0,VLOOKUP($I9,DrawPrep!$C$3:$F$34,2,FALSE),\"bye\")","v":"ΠΕΡΔΙΚΑΚΗΣ ΕΜΜΑΝΟΥΗΛ"},"ΠΕΡΔΙΚΑΚΗΣ",{"$f":"IF($I9>0,VLOOKUP($I9,DrawPrep!$C$3:$F$34,3,FALSE),\"\")","v":"Γ.Σ.ΛΙΒΥΚΟΣ ΙΕΡΑΠΕΤΡΑΣ"},1,{"$f":"IF((OR(M9=1,M9=2)),IF(M9=1,I9,I10),\"\")","v":36550},{"$f":"UPPER(IF($A$2=\"R\",IF(OR(M9=1,M9=\"a\"),I9,IF(OR(M9=2,M9=\"b\"),I10,\"\")),IF(OR(M9=1,M9=\"a\"),K9,IF(OR(M9=2,M9=\"b\"),K10,\"\"))))","v":"ΠΕΡΔΙΚΑΚΗΣ"},null,null,null,null,null,"40 41"]
[6,{"$f":"5-D10+8","v":12},9,1,{"$f":"IF($B$2>=C10,1,0)","v":0},{"$f":"IF(NOT($G10=\"-\"),VLOOKUP($G10,DrawPrep!$A$3:$F$34,2,FALSE),\"\")","v":0},{"$f":"IF($B$2>=C10,\"-\",VLOOKUP($B10,Setup!$K$2:$L$33,2,FALSE))","v":26},{"$f":"IF(NOT($G10=\"-\"),VLOOKUP($G10,DrawPrep!$A$3:$F$34,6,FALSE),0)","v":0},{"$f":"IF(Setup!$B$24=\"#\",0,IF(NOT($G10=\"-\"),VLOOKUP($G10,DrawPrep!$A$3:$F$34,3,FALSE),0))","v":37561},{"$f":"IF($I10>0,VLOOKUP($I10,DrawPrep!$C$3:$F$34,2,FALSE),\"bye\")","v":"ΦΟΥΝΤΟΥΛΑΚΗΣ ΝΙΚΟΛΑΟΣ"},"ΦΟΥΝΤΟΥΛΑΚΗΣ",{"$f":"IF($I10>0,VLOOKUP($I10,DrawPrep!$C$3:$F$34,3,FALSE),\"\")","v":"Ο.Α.ΧΑΝΙΩΝ"},null,null,"40 30 ret",2,{"$f":"IF((OR(P10=1,P10=2)),IF(P10=1,N9,N11),\"\")","v":32350},{"$f":"UPPER(IF($A$2=\"R\",IF(OR(P10=1,P10=\"a\"),O9,IF(OR(P10=2,P10=\"b\"),O11,\"\")),IF(OR(P10=1,P10=\"a\"),O9,IF(OR(P10=2,P10=\"b\"),O11,\"\"))))","v":"ΠΕΤΡΑΚΗΣ"},null,null," "]
{"$rows_left_out":57}
{"sheet":"Day1","index":3,"n_rows":80,"n_cols":6,"rows_kept":80,"cut":false,"hidden":false,"merged":[[2,5,3,5]]}
["Ζ΄ ΕΝΩΣΗ, 3ο Ε3 2016, Γ.Σ. ΛΙΒΥΚΟΣ ΙΕΡΑΠ. (Α12)"]
["Κ. Χατζηδάκης"]
["Πρόγραμμα αγώνων",null,null,null,"Round 1","i"]
["ΩΡΑ","Κτγρ.","Αθλητής-Σύλλογος",null,"Αθλητής-Σύλλογος"]
["Έναρξη","Α12","ΜΑΤΣΑΜΑΚΗΣ Ε (Ο.Α.ΧΑΝΙΩΝ)"," ",""]
[null,"Α12","ΚΩΣΤΑΚΗΣ Ε (ΗΡΑΚΛΕΙΟ Ο.Α.& Α.)","-","ΒΟΛΤΥΡΑΚΗΣ Ε (Ο.Α.ΧΑΝΙΩΝ)"]
[null,"Α12","ΠΕΡΔΙΚΑΚΗΣ Ε (Γ.Σ.ΛΙΒΥΚΟΣ ΙΕΡΑΠΕΤΡΑΣ)","-","ΦΟΥΝΤΟΥΛΑΚΗΣ Ν (Ο.Α.ΧΑΝΙΩΝ)"]
[null,"Α12",""," ","ΠΕΤΡΑΚΗΣ Σ (Ο.Α.ΧΑΝΙΩΝ)"]
[null,"Α12","ΓΕΝΝΑΡΑΚΗΣ Ν (ΗΡΑΚΛΕΙΟ Ο.Α.& Α.)"," ",""]
["όχι πριν","Α12","ΜΠΟΥΝΑΚΗΣ Δ (ΗΡΑΚΛΕΙΟ Ο.Α.& Α.)","-","ΚΑΛΑΤΖΗΣ Α (ΗΡΑΚΛΕΙΟ Ο.Α.& Α.)"]
{"$rows_left_out":71}
{"sheet":"Day2","index":4,"n_rows":20,"n_cols":6,"rows_kept":20,"cut":false,"hidden":false,"merged":[[2,5,3,5]]}
["Ζ΄ ΕΝΩΣΗ, 3ο Ε3 2016, Γ.Σ. ΛΙΒΥΚΟΣ ΙΕΡΑΠ. (Α12)"]
["Κ. Χατζηδάκης"]
["Πρόγραμμα αγώνων",null,null,null,"Round 1","i"]
["ΩΡΑ","Κτγρ.","Αθλητής-Σύλλογος",null,"Αθλητής-Σύλλογος"]
["Έναρξη","Α12","ΟΡΦΑΝΙΔΗΣ Μ (0)","-","ΚΟΥΛΟΥΜΠΗΣ Γ (0)"]
[null,"Α12","ΦΩΚΙΑΛΗΣ Γ (0)","-","ΔΕΣΥΠΡΗΣ Γ (0)"]
[null,"Α12","ΡΟΔΙΤΗΣ Ν (0)","-","ΠΑΠΟΥΤΣΗΣ Π (0)"]
[null,"Α12","ΠΕΡΡΗΣ Ν (0)","-","ΓΕΩΡΓΙΑΔΗΣ Α (0)"]
[null,"Α12","ΜΑΜΑΣΗΣ Γ (0)","-","ΜΩΥΣΙΔΗΣ Ν (0)"]
["όχι πριν","Α12","ΦΡΑΓΚΑΚΗΣ Τ (0)","-","ΠΕΝΣΟΣ Ε (0)"]
{"$rows_left_out":11}
{"sheet":"notes","index":5,"n_rows":0,"n_cols":0,"rows_kept":0,"cut":false,"hidden":false,"merged":[]}

{"sheet":"PrgPrep","index":6,"n_rows":37,"n_cols":8,"rows_kept":37,"cut":false,"hidden":false,"merged":[[2,5,3,5],[21,5,22,5]]}
[{"$f":"Setup!B3 & \", \" & Setup!B4 & \", \" & Setup!B7  & \" (\" & Setup!B8 & \")\"","v":"Ζ΄ ΕΝΩΣΗ, 3ο Ε3 2016, Γ.Σ. ΛΙΒΥΚΟΣ ΙΕΡΑΠ. (Α12)"},null,null,null,null,null,null,"Don't Change this Worksheet !"]
[{"$f":"Setup!$B$11","v":"Κ. Χατζηδάκης"}]
["Πρόγραμμα αγώνων",null,null,null,"Round 1","i"]
["ΩΡΑ","Κτγρ.","Αθλητής-Σύλλογος",null,"Αθλητής-Σύλλογος"]
["Έναρξη",{"$f":"Setup!$B$8","v":"Α12"},{"$f":"IF(OR(MD!J5=\"bye\",MD!J5=\"LWD\"),\"\",CONCATENATE(LEFT(MD!J5,FIND(\" \",MD!J5)+1),\" (\",MD!L5,\")\"))","v":"ΜΑΤΣΑΜΑΚΗΣ Ε (Ο.Α.ΧΑΝΙΩΝ)"},{"$f":"IF(OR(C5=\"\",E5=\"\"),\" \",\"-\")","v":" "},{"$f":"IF(OR(MD!J6=\"bye\",MD!J6=\"LWD\"), \"\", CONCATENATE(LEFT(MD!J6,FIND(\" \",MD!J6)+1),\" (\",MD!L6,\")\"))","v":""}]
[null,{"$f":"Setup!$B$8","v":"Α12"},{"$f":"IF(OR(MD!J7=\"bye\",MD!J7=\"LWD\"),\"\",CONCATENATE(LEFT(MD!J7,FIND(\" \",MD!J7)+1),\" (\",MD!L7,\")\"))","v":"ΚΩΣΤΑΚΗΣ Ε (ΗΡΑΚΛΕΙΟ Ο.Α.& Α.)"},{"$f":"IF(OR(C6=\"\",E6=\"\"),\" \",\"-\")","v":"-"},{"$f":"IF(OR(MD!J8=\"bye\",MD!J8=\"LWD\"), \"\", CONCATENATE(LEFT(MD!J8,FIND(\" \",MD!J8)+1),\" (\",MD!L8,\")\"))","v":"ΒΟΛΤΥΡΑΚΗΣ Ε (Ο.Α.ΧΑΝΙΩΝ)"}]
[null,{"$f":"Setup!$B$8","v":"Α12"},{"$f":"IF(OR(MD!J9=\"bye\",MD!J9=\"LWD\"),\"\",CONCATENATE(LEFT(MD!J9,FIND(\" \",MD!J9)+1),\" (\",MD!L9,\")\"))","v":"ΠΕΡΔΙΚΑΚΗΣ Ε (Γ.Σ.ΛΙΒΥΚΟΣ ΙΕΡΑΠΕΤΡΑΣ)"},"-",{"$f":"IF(OR(MD!J10=\"bye\",MD!J10=\"LWD\"), \"\", CONCATENATE(LEFT(MD!J10,FIND(\" \",MD!J10)+1),\" (\",MD!L10,\")\"))","v":"ΦΟΥΝΤΟΥΛΑΚΗΣ Ν (Ο.Α.ΧΑΝΙΩΝ)"}]
[null,{"$f":"Setup!$B$8","v":"Α12"},{"$f":"IF(OR(MD!J11=\"bye\",MD!J11=\"LWD\"),\"\",CONCATENATE(LEFT(MD!J11,FIND(\" \",MD!J11)+1),\" (\",MD!L11,\")\"))","v":""}," ",{"$f":"IF(OR(MD!J12=\"bye\",MD!J12=\"LWD\"), \"\", CONCATENATE(LEFT(MD!J12,FIND(\" \",MD!J12)+1),\" (\",MD!L12,\")\"))","v":"ΠΕΤΡΑΚΗΣ Σ (Ο.Α.ΧΑΝΙΩΝ)"}]
["όχι πριν",{"$f":"Setup!$B$8","v":"Α12"},{"$f":"IF(OR(MD!J13=\"bye\",MD!J13=\"LWD\"),\"\",CONCATENATE(LEFT(MD!J13,FIND(\" \",MD!J13)+1),\" (\",MD!L13,\")\"))","v":"ΓΕΝΝΑΡΑΚΗΣ Ν (ΗΡΑΚΛΕΙΟ Ο.Α.& Α.)"}," ",{"$f":"IF(OR(MD!J14=\"bye\",MD!J14=\"LWD\"), \"\", CONCATENATE(LEFT(MD!J14,FIND(\" \",MD!J14)+1),\" (\",MD!L14,\")\"))","v":""}]
[null,{"$f":"Setup!$B$8","v":"Α12"},{"$f":"IF(OR(MD!J15=\"bye\",MD!J15=\"LWD\"),\"\",CONCATENATE(LEFT(MD!J15,FIND(\" \",MD!J15)+1),\" (\",MD!L15,\")\"))","v":"ΜΠΟΥΝΑΚΗΣ Δ (ΗΡΑΚΛΕΙΟ Ο.Α.& Α.)"},"-",{"$f":"IF(OR(MD!J16=\"bye\",MD!J16=\"LWD\"), \"\", CONCATENATE(LEFT(MD!J16,FIND(\" \",MD!J16)+1),\" (\",MD!L16,\")\"))","v":"ΚΑΛΑΤΖΗΣ Α (ΗΡΑΚΛΕΙΟ Ο.Α.& Α.)"}]
{"$rows_left_out":28}
{"sheet":"tables","index":7,"n_rows":33,"n_cols":18,"rows_kept":33,"cut":false,"hidden":false,"merged":[]}
["RndIndx","random","FixRandom",null,null,"1ος","2ος","3-4","5-8","9-16","17-32",null,null,null,null,"Category","Juniors","Serniors"]
[1,{"$f":"RAND()/222","v":1.4902448672906941E-3},2.2591646294891051E-3,null,"E1-12",30,25,15,10,7.5,5,null,null,null,null,"Α10","Α10","m35"]
[2,2.6578711671515843E-3,1.3782004344844291E-3,null,"E1-14",60,50,30,20,15,10,null,null,null,null,"Α12","Α12","m40"]
[3,{"$f":"RAND()/222","v":1.1186494110028515E-3},2.7921291534137617E-3,null,"E1-16",120,100,60,40,30,20,null,null,null,null,"Α14","Α14","m45"]
[4,{"$f":"RAND()/222","v":2.7912771211533583E-4},3.7720781966312684E-3,null,"E1-18",150,125,75,50,37.5,25,null,null,null,null,"Α16","Α16","m50"]
[5,{"$f":"RAND()/222","v":3.439461412806375E-3},1.555645607844698E-3,null,"E2-12",15,12.5,7.5,5,4,2.5,null,null,null,null,"Α18","Α18","m55"]
[6,{"$f":"RAND()/222","v":6.2160423120227986E-4},3.6701533162968075E-3,null,"E2-14",30,25,15,10,8,5,null,null,null,null,"Κ10","Κ10","m60"]
[7,{"$f":"RAND()/222","v":3.8080867788397484E-3},2.8714698777152652E-3,null,"E2-16",60,50,30,20,16,10,null,null,null,null,"Κ12","Κ12","m65"]
[8,2.1527898268387764E-4,5.1329639305528992E-4,null,"E3-12",6,5,3,2,1.5,1,null,null,null,null,"Κ14","Κ14","m70"]
[9,2.2274336259334405E-3,3.7230987475287761E-3,null,"E3-14",12,10,6,4,3,2,null,null,null,null,"Κ16","Κ16","m75"]
{"$rows_left_out":24}
{"sheet":"matches","index":8,"n_rows":33,"n_cols":12,"rows_kept":33,"cut":false,"hidden":false,"merged":[[0,10,0,11],[0,1,0,2],[0,3,0,4]]}
["round","winner",null,"looser",null,"score",null," Player "," Position ",null,"Set-up"]
[32,{"$f":"IF(OR(MD!$M$5 =1,MD!$M$5 =2), IF(MD!$M$5 =1,MD!$I$5,MD!$I$6),\"#\")","v":31617},{"$f":"TRIM(LEFT(VLOOKUP(B2,DrawPrep!$C$3:$D$34,2,FALSE),FIND(\" \",VLOOKUP(B2,DrawPrep!$C$3:$D$34,2,FALSE),1)-1))","v":"ΜΑΤΣΑΜΑΚΗΣ"},{"$f":"IF(OR(MD!$M$5 =1,MD!$M$5 =2), IF(MD!$M$5 =2,MD!$I$5,MD!$I$6),\"#\")","v":0},{"$f":"TRIM(LEFT(VLOOKUP(D2,DrawPrep!$C$3:$D$34,2,FALSE),FIND(\" \",VLOOKUP(D2,DrawPrep!$C$3:$D$34,2,FALSE),1)-1))","v":{"$error":"#N/A"}},{"$f":"MD!O6","v":0},null,{"$f":"B32","v":31617},"1st",null,"title: ",{"$f":"Setup!$B$4","v":"3ο Ε3 2016"}]
[32,{"$f":"IF(OR(MD!$M$7 =1,MD!$M$7 =2), IF(MD!$M$7 =1,MD!$I$7,MD!$I$8),\"#\")","v":33295},{"$f":"TRIM(LEFT(VLOOKUP(B3,DrawPrep!$C$3:$D$34,2,FALSE),FIND(\" \",VLOOKUP(B3,DrawPrep!$C$3:$D$34,2,FALSE),1)-1))","v":"ΒΟΛΤΥΡΑΚΗΣ"},{"$f":"IF(OR(MD!$M$7 =1,MD!$M$7 =2), IF(MD!$M$7 =2,MD!$I$7,MD!$I$8),\"#\")","v":37805},{"$f":"TRIM(LEFT(VLOOKUP(D3,DrawPrep!$C$3:$D$34,2,FALSE),FIND(\" \",VLOOKUP(D3,DrawPrep!$C$3:$D$34,2,FALSE),1)-1))","v":"ΚΩΣΤΑΚΗΣ"},{"$f":"MD!O8","v":"54(4) 42"},null,{"$f":"D32","v":36263},"2nd",null,"grade: ",{"$f":"Setup!$B$5","v":"e3"}]
[32,{"$f":"IF(OR(MD!$M$9 =1,MD!$M$9 =2), IF(MD!$M$9 =1,MD!$I$9,MD!$I$10),\"#\")","v":36550},{"$f":"TRIM(LEFT(VLOOKUP(B4,DrawPrep!$C$3:$D$34,2,FALSE),FIND(\" \",VLOOKUP(B4,DrawPrep!$C$3:$D$34,2,FALSE),1)-1))","v":"ΠΕΡΔΙΚΑΚΗΣ"},{"$f":"IF(OR(MD!$M$9 =1,MD!$M$9 =2), IF(MD!$M$9 =2,MD!$I$9,MD!$I$10),\"#\")","v":37561},{"$f":"TRIM(LEFT(VLOOKUP(D4,DrawPrep!$C$3:$D$34,2,FALSE),FIND(\" \",VLOOKUP(D4,DrawPrep!$C$3:$D$34,2,FALSE),1)-1))","v":"ΦΟΥΝΤΟΥΛΑΚΗΣ"},{"$f":"MD!O10","v":"40 30 ret"},null,{"$f":"D30","v":36456},"3_4",null,"age: ",{"$f":"Setup!$B$6","v":12}]
[32,{"$f":"IF(OR(MD!$M$11=1,MD!$M$11=2), IF(MD!$M$11=1,MD!$I$11,MD!$I$12),\"#\")","v":32350},{"$f":"TRIM(LEFT(VLOOKUP(B5,DrawPrep!$C$3:$D$34,2,FALSE),FIND(\" \",VLOOKUP(B5,DrawPrep!$C$3:$D$34,2,FALSE),1)-1))","v":"ΠΕΤΡΑΚΗΣ"},{"$f":"IF(OR(MD!$M$11=1,MD!$M$11=2), IF(MD!$M$11=2,MD!$I$11,MD!$I$12),\"#\")","v":0},{"$f":"TRIM(LEFT(VLOOKUP(D5,DrawPrep!$C$3:$D$34,2,FALSE),FIND(\" \",VLOOKUP(D5,DrawPrep!$C$3:$D$34,2,FALSE),1)-1))","v":{"$error":"#N/A"}},{"$f":"MD!O12","v":0},null,{"$f":"D31","v":33396},"3_4",null,"category: ",{"$f":"Setup!$B$8","v":"Α12"}]
[32,{"$f":"IF(OR(MD!$M$13=1,MD!$M$13=2), IF(MD!$M$13=1,MD!$I$13,MD!$I$14),\"#\")","v":36456},{"$f":"TRIM(LEFT(VLOOKUP(B6,DrawPrep!$C$3:$D$34,2,FALSE),FIND(\" \",VLOOKUP(B6,DrawPrep!$C$3:$D$34,2,FALSE),1)-1))","v":"ΓΕΝΝΑΡΑΚΗΣ"},{"$f":"IF(OR(MD!$M$13=1,MD!$M$13=2), IF(MD!$M$13=2,MD!$I$13,MD!$I$14),\"#\")","v":0},{"$f":"TRIM(LEFT(VLOOKUP(D6,DrawPrep!$C$3:$D$34,2,FALSE),FIND(\" \",VLOOKUP(D6,DrawPrep!$C$3:$D$34,2,FALSE),1)-1))","v":{"$error":"#N/A"}},{"$f":"MD!O14","v":0},null,{"$f":"D26","v":32350},"5_8",null,"period: ",{"$f":"Setup!$B$9&\"-\"&Setup!$B$10","v":"22-23 Οκτωβρίου "}]
[32,{"$f":"IF(OR(MD!$M$15=1,MD!$M$15=2), IF(MD!$M$15=1,MD!$I$15,MD!$I$16),\"#\")","v":38042},{"$f":"TRIM(LEFT(VLOOKUP(B7,DrawPrep!$C$3:$D$34,2,FALSE),FIND(\" \",VLOOKUP(B7,DrawPrep!$C$3:$D$34,2,FALSE),1)-1))","v":"ΜΠΟΥΝΑΚΗΣ"},{"$f":"IF(OR(MD!$M$15=1,MD!$M$15=2), IF(MD!$M$15=2,MD!$I$15,MD!$I$16),\"#\")","v":37803},{"$f":"TRIM(LEFT(VLOOKUP(D7,DrawPrep!$C$3:$D$34,2,FALSE),FIND(\" \",VLOOKUP(D7,DrawPrep!$C$3:$D$34,2,FALSE),1)-1))","v":"ΚΑΛΑΤΖΗΣ"},{"$f":"MD!O16","v":"53 54(4)"},null,{"$f":"D27","v":37665},"5_8",null,"organizer: ",{"$f":"Setup!$B$3","v":"Ζ΄ ΕΝΩΣΗ"}]
[32,{"$f":"IF(OR(MD!$M$17=1,MD!$M$17=2), IF(MD!$M$17=1,MD!$I$17,MD!$I$18),\"#\")","v":37801},{"$f":"TRIM(LEFT(VLOOKUP(B8,DrawPrep!$C$3:$D$34,2,FALSE),FIND(\" \",VLOOKUP(B8,DrawPrep!$C$3:$D$34,2,FALSE),1)-1))","v":"ΚΑΡΑΚΩΣΤΑΣ"},{"$f":"IF(OR(MD!$M$17=1,MD!$M$17=2), IF(MD!$M$17=2,MD!$I$17,MD!$I$18),\"#\")","v":37800},{"$f":"TRIM(LEFT(VLOOKUP(D8,DrawPrep!$C$3:$D$34,2,FALSE),FIND(\" \",VLOOKUP(D8,DrawPrep!$C$3:$D$34,2,FALSE),1)-1))","v":"ΒΕΛΕΝΤΑΚΗΣ"},{"$f":"MD!O18","v":"40 40"},null,{"$f":"D28","v":37562},"5_8"]
[32,{"$f":"IF(OR(MD!$M$19=1,MD!$M$19=2), IF(MD!$M$19=1,MD!$I$19,MD!$I$20),\"#\")","v":37665},{"$f":"TRIM(LEFT(VLOOKUP(B9,DrawPrep!$C$3:$D$34,2,FALSE),FIND(\" \",VLOOKUP(B9,DrawPrep!$C$3:$D$34,2,FALSE),1)-1))","v":"ΚΟΚΚΙΝΑΚΗΣ"},{"$f":"IF(OR(MD!$M$19=1,MD!$M$19=2), IF(MD!$M$19=2,MD!$I$19,MD!$I$20),\"#\")","v":37990},{"$f":"TRIM(LEFT(VLOOKUP(D9,DrawPrep!$C$3:$D$34,2,FALSE),FIND(\" \",VLOOKUP(D9,DrawPrep!$C$3:$D$34,2,FALSE),1)-1))","v":"ΝΙΝΟΣ"},{"$f":"MD!O20","v":4040},null,{"$f":"D29","v":35629},"5_8"]
[32,{"$f":"IF(OR(MD!$M$21=1,MD!$M$21=2), IF(MD!$M$21=1,MD!$I$21,MD!$I$22),\"#\")","v":37032},{"$f":"TRIM(LEFT(VLOOKUP(B10,DrawPrep!$C$3:$D$34,2,FALSE),FIND(\" \",VLOOKUP(B10,DrawPrep!$C$3:$D$34,2,FALSE),1)-1))","v":"ΧΑΛΑΚΑΤΕΒΑΚΗΣ"},{"$f":"IF(OR(MD!$M$21=1,MD!$M$21=2), IF(MD!$M$21=2,MD!$I$21,MD!$I$22),\"#\")","v":0},{"$f":"TRIM(LEFT(VLOOKUP(D10,DrawPrep!$C$3:$D$34,2,FALSE),FIND(\" \",VLOOKUP(D10,DrawPrep!$C$3:$D$34,2,FALSE),1)-1))","v":{"$error":"#N/A"}},{"$f":"MD!O22","v":0},null,{"$f":"D18","v":33295},"9_16"]
{"$rows_left_out":23}