{"text_format":"1","workbook":"xlsx","n_sheets":9,"sheets":["Setup","DrawPrep","MD","Day1","Day2","notes","PrgPrep","tables","matches"],"not_rendered":{"charts":0,"images":0,"macros":1,"external_links":0,"defined_names":6,"comments":0,"pivot_tables":0},"unopened":[],"bounds":{"document_bytes":16777216,"sheet_cells":100000,"rows_first":2000,"rows_last":500,"rows_between":2000,"halvings":0,"cell_chars":16384,"cell_head_chars":4096},"cells_cut":0,"cells_raw":0,"read":"whole","date_system":"1900"}

{"sheet":"Setup","index":0,"n_rows":31,"n_cols":8,"rows_kept":31,"cut":false,"hidden":false,"merged":[[1,3,2,3]]}
["Μέγεθος ταμπλό: ",16,null,"Θέσεις","seed"]
[null,null,null,"3-4",{"$f":"VALUE(LEFT(F2,1))","v":4},"4 3"]
["Διοργανωτής: ","Ζ΄ ΕΝΩΣΗ",null,null,{"$f":"VALUE(RIGHT(F2,1))","v":3}]
["Τίτλος Τουρνουά: ","3ο Ε3 2016"]
["grade: ","e3"]
["age: ",12]
["Έδρα αγώνων: ","Γ.Σ. ΛΙΒΥΚΟΣ ΙΕΡΑΠ.",null,"0 0 0 0 0 0 1 2 3 4 6 5 9 10 7 8 "]
["Κατηγορία: ","Κ12",null,"1 2 3 4 "]
["Έναρξη: ","22",null,"0 0 0 0 0 0 0 0 0 0 0 0 0 0 0 0 0 0 0 0 0 0 0 0 0 0 0 0 0 0 0 0 0 0 0 0 0 0 0 0  "]
["Λήξη: ","23 Οκτωβρίου "]
{"$rows_left_out":22}
{"sheet":"DrawPrep","index":1,"n_rows":26,"n_cols":10,"rows_kept":26,"cut":false,"hidden":false,"merged":[[19,1,19,3]]}
[{"$f":"Setup!$B$3 & \", \" & Setup!$B$4 & \", \" & Setup!$B$7 & \", \" & Setup!$B$9 & \"-\" & Setup!$B$10","v":"Ζ΄ ΕΝΩΣΗ, 3ο Ε3 2016, Γ.Σ. ΛΙΒΥΚΟΣ ΙΕΡΑΠ., 22-23 Οκτωβρίου "},null,null,null,null,null,null,{"$f":"Setup!$B$8","v":"Κ12"}]
["α/α","από","Α.Μ.","Ονοματεπώνυμο","Σύλλογος","βαθμοί","Τηλέφωνο","Υπογραφή","SortPts","Rnd"]
[1,null,32156,"ΜΑΡΙΝΑΚΗ ΣΤΥΛΙΑΝΗ","Ο.Α.ΧΑΝΙΩΝ",37.5,null,null,{"$f":"IF(D3>\" \",F3+J3,0)","v":37.502019152457578},2.0191524575751377E-3]
[2,null,36200,"ΑΛΠΑΝΤΗ ΑΝΝΑ","Ο.Α.ΣΟΥΔΑΣ",28,null,null,28.001392133209119,1.3921332091181263E-3]
[3,null,36262,"ΝΤΑΜΠΑΚΑΚΗ ΧΡΥΣΗ","ΗΡΑΚΛΕΙΟ Ο.Α.& Α.",26.5,null,null,26.50148986238284,1.4898623828417503E-3]
[4,null,33640,"ΠΡΙΝΙΑΝΑΚΗ ΕΡΑΤΩ","ΦΙΛΙΑ Τ.Κ.",15.5,null," ",15.503065476265224,3.0654762652241583E-3]
[5,null,36510,"ΚΑΡΟΦΥΛΑΚΗ ΒΑΣΙΛΕΙΑ","Γ.Σ.ΛΙΒΥΚΟΣ ΙΕΡΑΠΕΤΡΑΣ",11.5,null,null,11.504464437376978,4.4644373769770068E-3]
[6,null,38221,"ΓΑΡΕΦΑΛΑΚΗ ΜΑΡΙΑ","ΗΡΑΚΛΕΙΟ Ο.Α.& Α.",11,null,null,11.003273957735686,3.2739577356865877E-3]
[7,null,36199,"ΚΑΡΑΠΑΝΤΑΖΗ ΚΑΛΛΙΟΠΗ-ΧΡΙΣΤΙΝΑ","Ο.Α.ΣΟΥΔΑΣ",10.5,null,null,10.50318629149476,3.1862914947605354E-3]
[8,null,38619,"ΧΑΤΖΗΑΘΑΝΑΣΙΑΔΗ ΙΩΑΝΝΑ","ΗΡΑΚΛΕΙΟ Ο.Α.& Α.",3.5,null,null,3.5009425334487685,9.4253344876866552E-4]
{"$rows_left_out":17}
{"sheet":"MD","index":2,"n_rows":44,"n_cols":21,"rows_kept":44,"cut":false,"hidden":false,"merged":[[26,20,26,21],[2,9,2,11],[0,0,0,17]]}
[{"$f":"Setup!B3 & \", \" & Setup!B4 & \", \" & Setup!B7 & \", \" & Setup!B9 & \"-\" & Setup!B10","v":"Ζ΄ ΕΝΩΣΗ, 3ο Ε3 2016, Γ.Σ. ΛΙΒΥΚΟΣ ΙΕΡΑΠ., 22-23 Οκτωβρίου "},null,null,null,null,null,null,null,null,null,null,null,null,null,null,null,null,null,null,null,{"$f":"Setup!B8","v":"Κ12"}]
[null,{"$f":"Setup!$B$18","v":6}]
[null,null,null,null,null,null,null,null,null,16,null,null,null,null,8,null,null,4,null,null,2]
["α/α",null,"ByeOrder","ByeSum","ByeCnt","από","seed","Pts","Α.Μ.","Ονοματεπώνυμο","επώνυμο","Σύλλογος"]
[1,1,null,null,0,{"$f":"IF(NOT($G5=\"-\"),VLOOKUP($G5,DrawPrep!$A$3:$G$18,2,FALSE),\"\")","v":0},{"$f":"VLOOKUP($B5,Setup!$G$12:$H$27,2,FALSE)","v":1},{"$f":"IF($G5>0,VLOOKUP($G5,DrawPrep!$A$3:$G$18,6,FALSE),0)","v":37.5},{"$f":"IF(Setup!$B$24=\"#\",0,IF($G5>0,VLOOKUP($G5,DrawPrep!$A$3:$G$18,3,FALSE),0))","v":32156},{"$f":"IF($I5>0,VLOOKUP($I5,DrawPrep!$C$3:$G$18,2,FALSE),\"bye\")","v":"ΜΑΡΙΝΑΚΗ ΣΤΥΛΙΑΝΗ"},{"$f":"IF(NOT(I5>0),\"\", IF(ISERROR(FIND(\"-\",J5)), LEFT(J5,FIND(\" \",J5)-1), IF(FIND(\"-\",J5)>FIND(\" \",J5),LEFT(J5,FIND(\" \",J5)-1), LEFT(J5,FIND(\"-\",J5)-1) )))","v":"ΜΑΡΙΝΑΚΗ"},{"$f":"IF($I5>0,VLOOKUP($I5,DrawPrep!$C$3:$G$18,3,FALSE),\"\")","v":"Ο.Α.ΧΑΝΙΩΝ"},1,{"$f":"IF(OR(M5=1,M5=2),IF(M5=1,I5,I6),\"\")","v":32156},{"$f":"UPPER(IF($A$2=\"R\",IF(OR(M5=1,M5=\"a\"),I5,IF(OR(M5=2,M5=\"b\"),I6,\"\")),IF(OR(M5=1,M5=\"1\"),K5,IF(OR(M5=2,M5=\"b\"),K6,\"\"))))","v":"ΜΑΡΙΝΑΚΗ"}]
[2,{"$f":"1-D6+4","v":4},1,{"$f":"E6","v":1},{"$f":"IF($B$2>=C6,1,0)","v":1},{"$f":"IF(NOT($G6=\"-\"),VLOOKUP($G6,DrawPrep!$A$3:$G$18,2,FALSE),\"\")","v":""},{"$f":"IF($B$2>=C6,\"-\",VLOOKUP($B6,Setup!$G$12:$H$27,2,FALSE))","v":"-"},{"$f":"IF(NOT($G6=\"-\"),VLOOKUP($G6,DrawPrep!$A$3:$G$18,6,FALSE),0)","v":0},{"$f":"IF(Setup!$B$24=\"#\",0,IF(NOT($G6=\"-\"),VLOOKUP($G6,DrawPrep!$A$3:$G$18,3,FALSE),0))","v":0},{"$f":"IF($I6>0,VLOOKUP($I6,DrawPrep!$C$3:$G$18,2,FALSE),\"bye\")","v":"bye"},{"$f":"IF(NOT(I6>0),\"\", IF(ISERROR(FIND(\"-\",J6)), LEFT(J6,FIND(\" \",J6)-1), IF(FIND(\"-\",J6)>FIND(\" \",J6),LEFT(J6,FIND(\" \",J6)-1), LEFT(J6,FIND(\"-\",J6)-1) )))","v":""},{"$f":"IF($I6>0,VLOOKUP($I6,DrawPrep!$C$3:$G$18,3,FALSE),\"\")","v":""},null,null,null,1,{"$f":"IF(OR(P6=1,P6=2),IF(P6=1,N5,N7),\"\")","v":32156},{"$f":"UPPER(IF($A$2=\"R\",IF(OR(P6=1,P6=\"a\"),O5,IF(OR(P6=2,P6=\"b\"),O7,\"\")),IF(OR(P6=1,P6=\"a\"),O5,IF(OR(P6=2,P6=\"b\"),O7,\"\"))))","v":"ΜΑΡΙΝΑΚΗ"}]
[3,{"$f":"2-D7+4","v":5},null,{"$f":"D6+E7","v":1},0,{"$f":"IF(NOT($G7=\"-\"),VLOOKUP($G7,DrawPrep!$A$3:$G$18,2,FALSE),\"\")","v":0},{"$f":"VLOOKUP($B7,Setup!$G$12:$H$27,2,FALSE)","v":6},{"$f":"IF($G7>0,VLOOKUP($G7,DrawPrep!$A$3:$G$18,6,FALSE),0)","v":11},{"$f":"IF(Setup!$B$24=\"#\",0,IF($G7>0,VLOOKUP($G7,DrawPrep!$A$3:$G$18,3,FALSE),0))","v":38221},{"$f":"IF($I7>0,VLOOKUP($I7,DrawPrep!$C$3:$G$18,2,FALSE),\"bye\")","v":"ΓΑΡΕΦΑΛΑΚΗ ΜΑΡΙΑ"},"ΓΑΡΕΦΑΛΑΚΗ",{"$f":"IF($I7>0,VLOOKUP($I7,DrawPrep!$C$3:$G$18,3,FALSE),\"\")","v":"ΗΡΑΚΛΕΙΟ Ο.Α.& Α."},1,{"$f":"IF(OR(M7=1,M7=2),IF(M7=1,I7,I8),\"\")","v":38221},{"$f":"UPPER(IF($A$2=\"R\",IF(OR(M7=1,M7=\"a\"),I7,IF(OR(M7=2,M7=\"b\"),I8,\"\")),IF(OR(M7=1,M7=\"a\"),K7,IF(OR(M7=2,M7=\"b\"),K8,\"\"))))","v":"ΓΑΡΕΦΑΛΑΚΗ"},null,null,"40 40"]
[4,{"$f":"3-D8+4","v":6},7,1,{"$f":"IF($B$2>=C8,1,0)","v":0},{"$f":"IF(NOT($G8=\"-\"),VLOOKUP($G8,DrawPrep!$A$3:$G$18,2,FALSE),\"\")","v":0},{"$f":"IF($B$2>=C8,\"-\",VLOOKUP($B8,Setup!$G$12:$H$27,2,FALSE))","v":5},{"$f":"IF(NOT($G8=\"-\"),VLOOKUP($G8,DrawPrep!$A$3:$G$18,6,FALSE),0)","v":11.5},{"$f":"IF(Setup!$B$24=\"#\",0,IF(NOT($G8=\"-\"),VLOOKUP($G8,DrawPrep!$A$3:$G$18,3,FALSE),0))","v":36510},{"$f":"IF($I8>0,VLOOKUP($I8,DrawPrep!$C$3:$G$18,2,FALSE),\"bye\")","v":"ΚΑΡΟΦΥΛΑΚΗ ΒΑΣΙΛΕΙΑ"},"ΚΑΡΟΦΥΛΑΚΗ",{"$f":"IF($I8>0,VLOOKUP($I8,DrawPrep!$C$3:$G$18,3,FALSE),\"\")","v":"Γ.Σ.ΛΙΒΥΚΟΣ ΙΕΡΑΠΕΤΡΑΣ"},null,null,"41 40",null,null,null,1,{"$f":"IF(OR(S8=1,S8=2),IF(S8=1,Q6,Q10),\"\")","v":32156},{"$f":"UPPER(IF($A$2=\"R\",IF(OR(S8=1,S8=\"a\"),R6,IF(OR(S8=2,S8=\"b\"),R10,\"\")),IF(OR(S8=1,S8=\"a\"),R6,IF(OR(S8=2,S8=\"b\"),R10,\"\"))))","v":"ΜΑΡΙΝΑΚΗ"}]
[5,{"$f":"VALUE(Setup!E2)","v":4},null,1,0,{"$f":"IF(NOT($G9=\"-\"),VLOOKUP($G9,DrawPrep!$A$3:$G$18,2,FALSE),\"\")","v":0},{"$f":"VLOOKUP($B9,Setup!$G$12:$H$27,2,FALSE)","v":4},{"$f":"IF($G9>0,VLOOKUP($G9,DrawPrep!$A$3:$G$18,6,FALSE),0)","v":15.5},{"$f":"IF(Setup!$B$24=\"#\",0,IF($G9>0,VLOOKUP($G9,DrawPrep!$A$3:$G$18,3,FALSE),0))","v":33640},{"$f":"IF($I9>0,VLOOKUP($I9,DrawPrep!$C$3:$G$18,2,FALSE),\"bye\")","v":"ΠΡΙΝΙΑΝΑΚΗ ΕΡΑΤΩ"},"ΠΡΙΝΙΑΝΑΚΗ",{"$f":"IF($I9>0,VLOOKUP($I9,DrawPrep!$C$3:$G$18,3,FALSE),\"\")","v":"ΦΙΛΙΑ Τ.Κ."},1,{"$f":"IF(OR(M9=1,M9=2),IF(M9=1,I9,I10),\"\")","v":33640},{"$f":"UPPER(IF($A$2=\"R\",IF(OR(M9=1,M9=\"a\"),I9,IF(OR(M9=2,M9=\"b\"),I10,\"\")),IF(OR(M9=1,M9=\"a\"),K9,IF(OR(M9=2,M9=\"b\"),K10,\"\"))))","v":"ΠΡΙΝΙΑΝΑΚΗ"},null,null,null,null,null,"61 62"]
[6,{"$f":"4-D10+4","v":6},{"$f":"IF(Setup!E2=3,3,4)","v":4},2,{"$f":"IF($B$2>=C10,1,0)","v":1},{"$f":"IF(NOT($G10=\"-\"),VLOOKUP($G10,DrawPrep!$A$3:$G$18,2,FALSE),\"\")","v":""},{"$f":"IF($B$2>=C10,\"-\",VLOOKUP($B10,Setup!$G$12:$H$27,2,FALSE))","v":"-"},{"$f":"IF(NOT($G10=\"-\"),VLOOKUP($G10,DrawPrep!$A$3:$G$18,6,FALSE),0)","v":0},{"$f":"IF(Setup!$B$24=\"#\",0,IF(NOT($G10=\"-\"),VLOOKUP($G10,DrawPrep!$A$3:$G$18,3,FALSE),0))","v":0},{"$f":"IF($I10>0,VLOOKUP($I10,DrawPrep!$C$3:$G$18,2,FALSE),\"bye\")","v":"bye"},"",{"$f":"IF($I10>0,VLOOKUP($I10,DrawPrep!$C$3:$G$18,3,FALSE),\"\")","v":""},null,null,null,1,{"$f":"IF(OR(P10=1,P10=2),IF(P10=1,N9,N11),\"\")","v":33640},{"$f":"UPPER(IF($A$2=\"R\",IF(OR(P10=1,P10=\"a\"),O9,IF(OR(P10=2,P10=\"b\"),O11,\"\")),IF(OR(P10=1,P10=\"a\"),O9,IF(OR(P10=2,P10=\"b\"),O11,\"\"))))","v":"ΠΡΙΝΙΑΝΑΚΗ"}]
{"$rows_left_out":35}
{"sheet":"Day1","index":3,"n_rows":12,"n_cols":6,"rows_kept":12,"cut":false,"hidden":false,"merged":[[2,5,3,5]]}
[{"$f":"Setup!B3 & \", \" & Setup!B4 & \", \" & Setup!B7  & \" (\" & Setup!B8 & \")\"","v":"Ζ΄ ΕΝΩΣΗ, 3ο Ε3 2016, Γ.Σ. ΛΙΒΥΚΟΣ ΙΕΡΑΠ. (Κ12)"}]
[{"$f":"Setup!$B$11","v":"Κ. Χατζηδάκης"}]
["Πρόγραμμα αγώνων",null,null,null,"Round 1","i"]
["ΩΡΑ","Κτγρ.","Αθλητής-Σύλλογος",null,"Αθλητής-Σύλλογος"]
["Έναρξη","Κ12","ΜΑΡΙΝΑΚΗ Σ (Ο.Α.ΧΑΝΙΩΝ)"," ",""]
[null,"Κ12","ΓΑΡΕΦΑΛΑΚΗ Μ (ΗΡΑΚΛΕΙΟ Ο.Α.& Α.)","-","ΚΑΡΟΦΥΛΑΚΗ Β (Γ.Σ.ΛΙΒΥΚΟΣ ΙΕΡΑΠΕΤΡΑΣ)"]
[null,"Κ12","ΠΡΙΝΙΑΝΑΚΗ Ε (ΦΙΛΙΑ Τ.Κ.)"," ",""]
[null,"Κ12",""," ","ΔΑΒΡΑΔΟΥ Ε (Α.Ο.ΛΑΤΩ ΑΓ.ΝΙΚΟΛΑΟΥ)"]
["όχι πριν","Κ12","ΝΤΑΜΠΑΚΑΚΗ Χ (ΗΡΑΚΛΕΙΟ Ο.Α.& Α.)"," ",""]
[null,"Κ12","ΚΟΚΚΙΝΑΚΗ Μ (Ο.Α.ΧΑΝΙΩΝ)"," ",""]
{"$rows_left_out":3}
{"sheet":"Day2","index":4,"n_rows":14,"n_cols":6,"rows_kept":14,"cut":false,"hidden":false,"merged":[[2,5,3,5]]}
[{"$f":"Setup!B3 & \", \" & Setup!B4 & \", \" & Setup!B7  & \" (\" & Setup!B8 & \")\"","v":"Ζ΄ ΕΝΩΣΗ, 3ο Ε3 2016, Γ.Σ. ΛΙΒΥΚΟΣ ΙΕΡΑΠ. (Κ12)"}]
[{"$f":"Setup!$B$11","v":"Κ. Χατζηδάκης"}]
["Πρόγραμμα αγώνων",null,null,null,"Round 2","i"]
["ΩΡΑ","Κτγρ.","Αθλητής-Σύλλογος",null,"Αθλητής-Σύλλογος"]
["Έναρξη","Α12","ΟΡΦΑΝΙΔΗΣ Μ (0)","-","ΚΑΝΕΛΛΟΠΟΥΛΟΣ Α (0)"]
[null,"Α12","ΘΕΟΔΩΡΟΥ Κ (0)","-","ΣΤΑΥΡΙΔΗΣ Π (0)"]
[null,"Α12","ΜΑΜΑΣΗΣ Γ (0)","-","ΚΟΥΤΣΟΓΙΩΡΓΟΣ Σ (0)"]
[null,"Α12","ΡΟΔΙΤΗΣ Ν (0)","-","ΓΕΩΡΓΙΑΔΗΣ Α (0)"]
["όχι πριν"]
[]
{"$rows_left_out":5}
{"sheet":"notes","index":5,"n_rows":0,"n_cols":0,"rows_kept":0,"cut":false,"hidden":false,"merged":[]}

{"sheet":"PrgPrep","index":6,"n_rows":30,"n_cols":7,"rows_kept":30,"cut":false,"hidden":false,"merged":[[2,5,3,5],[17,5,18,5]]}
[{"$f":"Setup!B3 & \", \" & Setup!B4 & \", \" & Setup!B7  & \" (\" & Setup!B8 & \")\"","v":"Ζ΄ ΕΝΩΣΗ, 3ο Ε3 2016, Γ.Σ. ΛΙΒΥΚΟΣ ΙΕΡΑΠ. (Κ12)"},null,null,null,null,null,"Don't Change this Worksheet !"]
[{"$f":"Setup!$B$11","v":"Κ. Χατζηδάκης"}]
["Πρόγραμμα αγώνων",null,null,null,"Round 1","i"]
["ΩΡΑ","Κτγρ.","Αθλητής-Σύλλογος",null,"Αθλητής-Σύλλογος"]
["Έναρξη",{"$f":"Setup!$B$8","v":"Κ12"},{"$f":"IF(OR(MD!J5=\"bye\",MD!J5=\"LWD\"), \"\",CONCATENATE(LEFT(MD!J5,FIND(\" \",MD!J5)+1),\" (\",MD!L5,\")\"))","v":"ΜΑΡΙΝΑΚΗ Σ (Ο.Α.ΧΑΝΙΩΝ)"},{"$f":"IF(OR(C5=\"\",E5=\"\"),\" \",\"-\")","v":" "},{"$f":"IF(OR(MD!J6=\"bye\",MD!J6=\"LWD\"), \"\",CONCATENATE(LEFT(MD!J6,FIND(\" \",MD!J6)+1),\" (\",MD!L6,\")\"))","v":""}]
[null,{"$f":"Setup!$B$8","v":"Κ12"},{"$f":"IF(OR(MD!J7=\"bye\",MD!J7=\"LWD\"), \"\",CONCATENATE(LEFT(MD!J7,FIND(\" \",MD!J7)+1),\" (\",MD!L7,\")\"))","v":"ΓΑΡΕΦΑΛΑΚΗ Μ (ΗΡΑΚΛΕΙΟ Ο.Α.& Α.)"},{"$f":"IF(OR(C6=\"\",E6=\"\"),\" \",\"-\")","v":"-"},{"$f":"IF(OR(MD!J8=\"bye\",MD!J8=\"LWD\"), \"\",CONCATENATE(LEFT(MD!J8,FIND(\" \",MD!J8)+1),\" (\",MD!L8,\")\"))","v":"ΚΑΡΟΦΥΛΑΚΗ Β (Γ.Σ.ΛΙΒΥΚΟΣ ΙΕΡΑΠΕΤΡΑΣ)"}]
[null,{"$f":"Setup!$B$8","v":"Κ12"},{"$f":"IF(OR(MD!J9=\"bye\",MD!J9=\"LWD\"), \"\",CONCATENATE(LEFT(MD!J9,FIND(\" \",MD!J9)+1),\" (\",MD!L9,\")\"))","v":"ΠΡΙΝΙΑΝΑΚΗ Ε (ΦΙΛΙΑ Τ.Κ.)"}," ",{"$f":"IF(OR(MD!J10=\"bye\",MD!J10=\"LWD\"), \"\",CONCATENATE(LEFT(MD!J10,FIND(\" \",MD!J10)+1),\" (\",MD!L10,\")\"))","v":""}]
[null,{"$f":"Setup!$B$8","v":"Κ12"},{"$f":"IF(OR(MD!J11=\"bye\",MD!J11=\"LWD\"), \"\",CONCATENATE(LEFT(MD!J11,FIND(\" \",MD!J11)+1),\" (\",MD!L11,\")\"))","v":""}," ",{"$f":"IF(OR(MD!J12=\"bye\",MD!J12=\"LWD\"), \"\",CONCATENATE(LEFT(MD!J12,FIND(\" \",MD!J12)+1),\" (\",MD!L12,\")\"))","v":"ΔΑΒΡΑΔΟΥ Ε (Α.Ο.ΛΑΤΩ ΑΓ.ΝΙΚΟΛΑΟΥ)"}]
["όχι πριν",{"$f":"Setup!$B$8","v":"Κ12"},{"$f":"IF(OR(MD!J13=\"bye\",MD!J13=\"LWD\"), \"\",CONCATENATE(LEFT(MD!J13,FIND(\" \",MD!J13)+1),\" (\",MD!L13,\")\"))","v":"ΝΤΑΜΠΑΚΑΚΗ Χ (ΗΡΑΚΛΕΙΟ Ο.Α.& Α.)"}," ",{"$f":"IF(OR(MD!J14=\"bye\",MD!J14=\"LWD\"), \"\",CONCATENATE(LEFT(MD!J14,FIND(\" \",MD!J14)+1),\" (\",MD!L14,\")\"))","v":""}]
[null,{"$f":"Setup!$B$8","v":"Κ12"},{"$f":"IF(OR(MD!J15=\"bye\",MD!J15=\"LWD\"), \"\",CONCATENATE(LEFT(MD!J15,FIND(\" \",MD!J15)+1),\" (\",MD!L15,\")\"))","v":"ΚΟΚΚΙΝΑΚΗ Μ (Ο.Α.ΧΑΝΙΩΝ)"}," ",{"$f":"IF(OR(MD!J16=\"bye\",MD!J16=\"LWD\"), \"\",CONCATENATE(LEFT(MD!J16,FIND(\" \",MD!J16)+1),\" (\",MD!L16,\")\"))","v":""}]
{"$rows_left_out":21}
{"sheet":"tables","index":7,"n_rows":17,"n_cols":18,"rows_kept":17,"cut":false,"hidden":false,"merged":[]}
["RndIndx","random","FixRandom",null,null,"1ος","2ος","3-4","5-8","9-16","17-32",null,null,null,null,"Category","Juniors","Serniors"]
[1,{"$f":"RAND()/222","v":6.022163226759408E-4},2.0191524575751377E-3,null,"E1-12",30,25,15,10,7.5,5,null,null,null,null,"Α10","Α10","m35"]
[2,{"$f":"RAND()/222","v":1.6936435474424131E-3},1.3921332091181263E-3,null,"E1-14",60,50,30,20,15,10,null,null,null,null,"Α12","Α12","m40"]
[3,{"$f":"RAND()/222","v":1.5258752620585525E-3},1.4898623828417503E-3,null,"E1-16",120,100,60,40,30,20,null,null,null,null,"Α14","Α14","m45"]
[4,{"$f":"RAND()/222","v":1.4772598998540082E-3},3.0654762652241583E-3,null,"E1-18",150,125,75,50,37.5,25,null,null,null,null,"Α16","Α16","m50"]
[5,{"$f":"RAND()/222","v":2.0892769246697303E-4},4.4644373769770068E-3,null,"E2-12",15,12.5,7.5,5,4,2.5,null,null,null,null,"Α18","Α18","m55"]
[6,{"$f":"RAND()/222","v":3.5045680604933968E-3},3.2739577356865877E-3,null,"E2-14",30,25,15,10,8,5,null,null,null,null,"Κ10","Κ10","m60"]
[7,2.6789371009477373E-3,3.1862914947605354E-3,null,"E2-16",60,50,30,20,16,10,null,null,null,null,"Κ12","Κ12","m65"]
[8,4.1873508825608112E-3,9.4253344876866552E-4,null,"E3-12",6,5,3,2,1.5,1,null,null,null,null,"Κ14","Κ14","m70"]
[9,1.0113632775028169E-3,2.0319794036252935E-3,null,"E3-14",12,10,6,4,3,2,null,null,null,null,"Κ16","Κ16","m75"]
{"$rows_left_out":8}
{"sheet":"matches","index":8,"n_rows":17,"n_cols":12,"rows_kept":17,"cut":false,"hidden":false,"merged":[[0,10,0,11],[0,1,0,2],[0,3,0,4]]}
["round","winner",null,"looser",null,"score",null," Player "," Position ",null,"Set-up"]
[16,{"$f":"IF(OR(MD!$M$5=1,MD!$M$5=2), IF(MD!$M$5=1,MD!$I$5,MD!$I$6),\"#\")","v":32156},{"$f":"TRIM(LEFT(VLOOKUP(B2,DrawPrep!$C$3:$D$18,2,FALSE),FIND(\" \",VLOOKUP(B2,DrawPrep!$C$3:$D$18,2,FALSE),1)-1))","v":"ΜΑΡΙΝΑΚΗ"},{"$f":"IF(OR(MD!$M$5 =1,MD!$M$5 =2), IF(MD!$M$5 =2,MD!$I$5,MD!$I$6),\"#\")","v":0},{"$f":"TRIM(LEFT(VLOOKUP(D2,DrawPrep!$C$3:$D$18,2,FALSE),FIND(\" \",VLOOKUP(D2,DrawPrep!$C$3:$D$18,2,FALSE),1)-1))","v":{"$error":"#N/A"}},{"$f":"MD!O6","v":0},null,{"$f":"B16","v":32156},"1st",null,"title: ",{"$f":"Setup!$B$4","v":"3ο Ε3 2016"}]
[16,{"$f":"IF(OR(MD!$M$7=1,MD!$M$7=2), IF(MD!$M$7=1,MD!$I$7,MD!$I$8),\"#\")","v":38221},{"$f":"TRIM(LEFT(VLOOKUP(B3,DrawPrep!$C$3:$D$18,2,FALSE),FIND(\" \",VLOOKUP(B3,DrawPrep!$C$3:$D$18,2,FALSE),1)-1))","v":"ΓΑΡΕΦΑΛΑΚΗ"},{"$f":"IF(OR(MD!$M$7 =1,MD!$M$7 =2), IF(MD!$M$7 =2,MD!$I$7,MD!$I$8),\"#\")","v":36510},{"$f":"TRIM(LEFT(VLOOKUP(D3,DrawPrep!$C$3:$D$18,2,FALSE),FIND(\" \",VLOOKUP(D3,DrawPrep!$C$3:$D$18,2,FALSE),1)-1))","v":"ΚΑΡΟΦΥΛΑΚΗ"},{"$f":"MD!O8","v":"41 40"},null,{"$f":"D16","v":36200},"2nd",null,"grade: ",{"$f":"Setup!$B$5","v":"e3"}]
[16,{"$f":"IF(OR(MD!$M$9=1,MD!$M$9=2), IF(MD!$M$9=1,MD!$I$9,MD!$I$10),\"#\")","v":33640},{"$f":"TRIM(LEFT(VLOOKUP(B4,DrawPrep!$C$3:$D$18,2,FALSE),FIND(\" \",VLOOKUP(B4,DrawPrep!$C$3:$D$18,2,FALSE),1)-1))","v":"ΠΡΙΝΙΑΝΑΚΗ"},{"$f":"IF(OR(MD!$M$9 =1,MD!$M$9 =2), IF(MD!$M$9 =2,MD!$I$9,MD!$I$10),\"#\")","v":0},{"$f":"TRIM(LEFT(VLOOKUP(D4,DrawPrep!$C$3:$D$18,2,FALSE),FIND(\" \",VLOOKUP(D4,DrawPrep!$C$3:$D$18,2,FALSE),1)-1))","v":{"$error":"#N/A"}},{"$f":"MD!O10","v":0},null,{"$f":"D14","v":33640},"3_4",null,"age: ",{"$f":"Setup!$B$6","v":12}]
[16,{"$f":"IF(OR(MD!$M$11=1,MD!$M$11=2), IF(MD!$M$11=1,MD!$I$11,MD!$I$12),\"#\")","v":36599},{"$f":"TRIM(LEFT(VLOOKUP(B5,DrawPrep!$C$3:$D$18,2,FALSE),FIND(\" \",VLOOKUP(B5,DrawPrep!$C$3:$D$18,2,FALSE),1)-1))","v":"ΔΑΒΡΑΔΟΥ"},{"$f":"IF(OR(MD!$M$11=1,MD!$M$11=2), IF(MD!$M$11=2,MD!$I$11,MD!$I$12),\"#\")","v":0},{"$f":"TRIM(LEFT(VLOOKUP(D5,DrawPrep!$C$3:$D$18,2,FALSE),FIND(\" \",VLOOKUP(D5,DrawPrep!$C$3:$D$18,2,FALSE),1)-1))","v":{"$error":"#N/A"}},{"$f":"MD!O12","v":0},null,{"$f":"D15","v":36262},"3_4",null,"category: ",{"$f":"Setup!$B$8","v":"Κ12"}]
[16,{"$f":"IF(OR(MD!$M$13=1,MD!$M$13=2), IF(MD!$M$13=1,MD!$I$13,MD!$I$14),\"#\")","v":36262},{"$f":"TRIM(LEFT(VLOOKUP(B6,DrawPrep!$C$3:$D$18,2,FALSE),FIND(\" \",VLOOKUP(B6,DrawPrep!$C$3:$D$18,2,FALSE),1)-1))","v":"ΝΤΑΜΠΑΚΑΚΗ"},{"$f":"IF(OR(MD!$M$13=1,MD!$M$13=2), IF(MD!$M$13=2,MD!$I$13,MD!$I$14),\"#\")","v":0},{"$f":"TRIM(LEFT(VLOOKUP(D6,DrawPrep!$C$3:$D$18,2,FALSE),FIND(\" \",VLOOKUP(D6,DrawPrep!$C$3:$D$18,2,FALSE),1)-1))","v":{"$error":"#N/A"}},{"$f":"MD!O14","v":0},null,{"$f":"D10","v":38221},"5_8",null,"period: ",{"$f":"Setup!$B$9&\"-\"&Setup!$B$10","v":"22-23 Οκτωβρίου "}]
[16,{"$f":"IF(OR(MD!$M$15=1,MD!$M$15=2), IF(MD!$M$15=1,MD!$I$15,MD!$I$16),\"#\")","v":37666},{"$f":"TRIM(LEFT(VLOOKUP(B7,DrawPrep!$C$3:$D$18,2,FALSE),FIND(\" \",VLOOKUP(B7,DrawPrep!$C$3:$D$18,2,FALSE),1)-1))","v":"ΚΟΚΚΙΝΑΚΗ"},{"$f":"IF(OR(MD!$M$15=1,MD!$M$15=2), IF(MD!$M$15=2,MD!$I$15,MD!$I$16),\"#\")","v":0},{"$f":"TRIM(LEFT(VLOOKUP(D7,DrawPrep!$C$3:$D$18,2,FALSE),FIND(\" \",VLOOKUP(D7,DrawPrep!$C$3:$D$18,2,FALSE),1)-1))","v":{"$error":"#N/A"}},{"$f":"MD!O16","v":0},null,{"$f":"D11","v":36599},"5_8",null,"organizer: ",{"$f":"Setup!$B$3","v":"Ζ΄ ΕΝΩΣΗ"}]
[16,{"$f":"IF(OR(MD!$M$17=1,MD!$M$17=2), IF(MD!$M$17=1,MD!$I$17,MD!$I$18),\"#\")","v":36199},{"$f":"TRIM(LEFT(VLOOKUP(B8,DrawPrep!$C$3:$D$18,2,FALSE),FIND(\" \",VLOOKUP(B8,DrawPrep!$C$3:$D$18,2,FALSE),1)-1))","v":"ΚΑΡΑΠΑΝΤΑΖΗ"},{"$f":"IF(OR(MD!$M$17=1,MD!$M$17=2), IF(MD!$M$17=2,MD!$I$17,MD!$I$18),\"#\")","v":38619},{"$f":"TRIM(LEFT(VLOOKUP(D8,DrawPrep!$C$3:$D$18,2,FALSE),FIND(\" \",VLOOKUP(D8,DrawPrep!$C$3:$D$18,2,FALSE),1)-1))","v":"ΧΑΤΖΗΑΘΑΝΑΣΙΑΔΗ"},{"$f":"MD!O18","v":"41 40"},null,{"$f":"D12","v":37666},"5_8"]
[16,{"$f":"IF(OR(MD!$M$19=1,MD!$M$19=2), IF(MD!$M$19=1,MD!$I$19,MD!$I$20),\"#\")","v":36200},{"$f":"TRIM(LEFT(VLOOKUP(B9,DrawPrep!$C$3:$D$18,2,FALSE),FIND(\" \",VLOOKUP(B9,DrawPrep!$C$3:$D$18,2,FALSE),1)-1))","v":"ΑΛΠΑΝΤΗ"},{"$f":"IF(OR(MD!$M$19=1,MD!$M$19=2), IF(MD!$M$19=2,MD!$I$19,MD!$I$20),\"#\")","v":0},{"$f":"TRIM(LEFT(VLOOKUP(D9,DrawPrep!$C$3:$D$18,2,FALSE),FIND(\" \",VLOOKUP(D9,DrawPrep!$C$3:$D$18,2,FALSE),1)-1))","v":{"$error":"#N/A"}},{"$f":"MD!O20","v":0},null,{"$f":"D13","v":36199},"5_8"]
[8,{"$f":"IF(OR(MD!$P$6=1,MD!$P$6=2), IF(MD!$P$6 =1,MD!$N$5,MD!$N$7),\"#\")","v":32156},{"$f":"TRIM(LEFT(VLOOKUP(B10,DrawPrep!$C$3:$D$18,2,FALSE),FIND(\" \",VLOOKUP(B10,DrawPrep!$C$3:$D$18,2,FALSE),1)-1))","v":"ΜΑΡΙΝΑΚΗ"},{"$f":"IF(OR(MD!$P$6 =1,MD!$P$6 =2), IF(MD!$P$6 =2,MD!$N$5,MD!$N$7),\"#\")","v":38221},{"$f":"TRIM(LEFT(VLOOKUP(D10,DrawPrep!$C$3:$D$18,2,FALSE),FIND(\" \",VLOOKUP(D10,DrawPrep!$C$3:$D$18,2,FALSE),1)-1))","v":"ΓΑΡΕΦΑΛΑΚΗ"},{"$f":"MD!R7","v":"40 40"},null,{"$f":"D2","v":0},"9_16"]
{"$rows_left_out":7}